Nickel tetracarbonyl
- Formula: C4NiO4
- Molecular weight: 170.7338
- IUPAC Standard InChIKey: AWDHUGLHGCVIEG-UHFFFAOYSA-N
- CAS Registry Number: 13463-39-3
- Chemical structure:
View 3d structure (requires JavaScript / HTML 5) - Other names: Nickel carbonyl (Ni(CO)4); Nickel carbonyl (Ni(CO)4), (T-4)-; Nickel carbonyl; Tetracarbonyl nickel; Ni(CO)4; Nickel carbonyle; Nichel tetracarbonile; Nikkeltetracarbonyl; Nickel tetracarbonyle; Rcra waste number P073; UN 1259

Gas phase thermochemistry data

Data compiled as indicated in comments:
MS - José A. Martinho Simões
Quantity | Value | Units | Method | Reference | Comment |
---|---|---|---|---|---|
ΔfH°gas | -601.58 | kJ/mol | Review | Chase, 1998 | Data last reviewed in March, 1978 |
ΔfH°gas | -594.8 ± 4.3 | kJ/mol | Review | Martinho Simões | MS |
ΔfH°gas | -605.8 ± 4.5 | kJ/mol | Review | Martinho Simões | MS |
ΔfH°gas | -602.5 ± 2.6 | kJ/mol | Review | Martinho Simões | MS |
Quantity | Value | Units | Method | Reference | Comment |
S°gas,1 bar | 415.53 | J/mol*K | Review | Chase, 1998 | Data last reviewed in March, 1978 |
Gas Phase Heat Capacity (Shomate Equation)
Cp° = A + B*t + C*t2 + D*t3 +
E/t2
H° − H°298.15= A*t + B*t2/2 +
C*t3/3 + D*t4/4 − E/t + F − H
S° = A*ln(t) + B*t + C*t2/2 + D*t3/3 −
E/(2*t2) + G
Cp = heat capacity (J/mol*K)
H° = standard enthalpy (kJ/mol)
S° = standard entropy (J/mol*K)
t = temperature (K) / 1000.
View plot Requires a JavaScript / HTML 5 canvas capable browser.
Temperature (K) | 700. to 1500. | 1500. to 6000. |
---|---|---|
A | 142.1840 | 202.6629 |
B | 73.15138 | 2.826121 |
C | -29.39775 | -0.456035 |
D | 3.701526 | 0.029612 |
E | -1.081029 | -18.39500 |
F | -650.5869 | -701.6484 |
G | 560.9824 | 609.6716 |
H | -601.5755 | -601.5755 |
Reference | Chase, 1998 | Chase, 1998 |
Comment | Data last reviewed in March, 1978 | Data last reviewed in March, 1978 |

Condensed phase thermochemistry data

Data compiled as indicated in comments:
MS - José A. Martinho Simões
Quantity | Value | Units | Method | Reference | Comment |
---|---|---|---|---|---|
ΔfH°liquid | -631.78 | kJ/mol | Review | Chase, 1998 | Data last reviewed in March, 1978 |
ΔfH°liquid | -633.4 ± 4.3 | kJ/mol | Review | Martinho Simões | MS |
ΔfH°liquid | -630.1 ± 2.9 | kJ/mol | Review | Martinho Simões | MS |
Quantity | Value | Units | Method | Reference | Comment |
ΔcH°liquid | -1180.3 ± 4.2 | kJ/mol | CC-SB | Fischer, Cotton, et al., 1957 | Please also see Pedley and Rylance, 1977 and Cox and Pilcher, 1970.; MS |
Quantity | Value | Units | Method | Reference | Comment |
S°liquid,1 bar | 319.56 | J/mol*K | Review | Chase, 1998 | Data last reviewed in March, 1978 |
Liquid Phase Heat Capacity (Shomate Equation)
Cp° = A + B*t + C*t2 + D*t3 +
E/t2
H° − H°298.15= A*t + B*t2/2 +
C*t3/3 + D*t4/4 − E/t + F − H
S° = A*ln(t) + B*t + C*t2/2 + D*t3/3 −
E/(2*t2) + G
Cp = heat capacity (J/mol*K)
H° = standard enthalpy (kJ/mol)
S° = standard entropy (J/mol*K)
t = temperature (K) / 1000.
View plot Requires a JavaScript / HTML 5 canvas capable browser.
Temperature (K) | 298. to 700. |
---|---|
A | 186.0001 |
B | 58.69901 |
C | -5.142973 |
D | 2.651126 |
E | 0.019514 |
F | -689.7450 |
G | 527.4643 |
H | -631.7840 |
Reference | Chase, 1998 |
Comment | Data last reviewed in March, 1978 |

Gas phase ion energetics data

Data evaluated as indicated in comments:
HL - Edward P. Hunter and Sharon G. Lias
L - Sharon G. Lias
Data compiled as indicated in comments:
LBLHLM - Sharon G. Lias, John E. Bartmess, Joel F. Liebman, John L. Holmes, Rhoda D. Levin, and W. Gary Mallard
LLK - Sharon G. Lias, Rhoda D. Levin, and Sherif A. Kafafi
RDSH - Henry M. Rosenstock, Keith Draxl, Bruce W. Steiner, and John T. Herron
LL - Sharon G. Lias and Joel F. Liebman
Quantity | Value | Units | Method | Reference | Comment |
---|---|---|---|---|---|
IE (evaluated) | 8.27 ± 0.04 | eV | N/A | N/A | L |
Quantity | Value | Units | Method | Reference | Comment |
Proton affinity (review) | 742.3 | kJ/mol | N/A | Hunter and Lias, 1998 | HL |
Quantity | Value | Units | Method | Reference | Comment |
Gas basicity | 716.0 | kJ/mol | N/A | Hunter and Lias, 1998 | HL |
Ionization energy determinations
IE (eV) | Method | Reference | Comment |
---|---|---|---|
~8.0 | PE | Reutt, Wang, et al., 1986 | LBLHLM |
8.8 ± 0.2 | EI | Clements and Sale, 1976 | LLK |
8.21 ± 0.03 | PE | Hillier, Guest, et al., 1974 | LLK |
8.32 ± 0.01 | PI | Distefano, 1970 | RDSH |
8.28 ± 0.01 | PI | Lloyd and Schlag, 1969 | RDSH |
8.24 ± 0.14 | PE | Lloyd and Schlag, 1969 | RDSH |
8.75 ± 0.07 | EI | Junk and Svec, 1968 | RDSH |
8.35 ± 0.15 | EI | Schildcrout, Pressley, et al., 1967 | RDSH |
8.57 ± 0.10 | EI | Bidinosti and McIntyre, 1967 | RDSH |
8.64 ± 0.15 | EI | Winters and Kiser, 1964 | RDSH |
8.28 ± 0.03 | PI | Vilesov and Kurbatov, 1961 | RDSH |
8.722 ± 0.010 | PE | Reutt, Wang, et al., 1986 | Vertical value; LBLHLM |
Appearance energy determinations

Reaction thermochemistry data

Data compiled by: José A. Martinho Simões
Individual Reactions
By formula: C4NiO4 (g) = 4CO (g) + Ni (cr)
Quantity | Value | Units | Method | Reference | Comment |
---|---|---|---|---|---|
ΔrH° | 160.4 ± 2.5 | kJ/mol | EqG | Monteil, Raffin, et al., 1988 | The reaction enthalpy is the average of several 2nd and 3rd law results Monteil, Raffin, et al., 1988 |
(solution) = C3NiO3 (solution) +
(solution)
By formula: C4NiO4 (solution) = C3NiO3 (solution) + CO (solution)
Quantity | Value | Units | Method | Reference | Comment |
---|---|---|---|---|---|
ΔrH° | 94.6 | kJ/mol | KinS | Turner, Simpson, et al., 1983 | solvent: Liquid krypton; The reaction enthalpy relies on the experimental value for the activation enthalpy, 94.6 kJ/mol, and on the assumption that the activation enthalpy for product recombination is negligible Turner, Simpson, et al., 1983. |
(g) = C3NiO3 (g) +
(g)
By formula: C4NiO4 (g) = C3NiO3 (g) + CO (g)
Quantity | Value | Units | Method | Reference | Comment |
---|---|---|---|---|---|
ΔrH° | 104. ± 8. | kJ/mol | N/A | Stevens, Feigerle, et al., 1982 | Please also see Compton and Stockdale, 1976. The enthalpy of formation relies on -602.5 ± 2.6 kJ/mol for the enthalpy of formation of Ni(CO)4(g) Method: LPS and collision with low energy electrons. |
By formula: 4CO (g) + Ni (cr) = C4NiO4 (g)
Quantity | Value | Units | Method | Reference | Comment |
---|---|---|---|---|---|
ΔrH° | -152.7 ± 4.2 | kJ/mol | EqG | Sykes and Townshend, 1955 | Please also see Pedley and Rylance, 1977 and Cox and Pilcher, 1970. Temperatures: 398 and 409 K. The reaction enthalpy was obtained by the 3rd law method and refers to 298 K |
C9FeNiO9 (g) = (g) +
(g)
By formula: C9FeNiO9 (g) = C4NiO4 (g) + C5FeO5 (g)
Quantity | Value | Units | Method | Reference | Comment |
---|---|---|---|---|---|
ΔrH° | 37.7 | kJ/mol | EqG | Baev and Fedulova, 1983 | Temperature range: 293-313 K |

Phase change data

Data compiled as indicated in comments:
MS - José A. Martinho Simões
AC - William E. Acree, Jr., James S. Chickos
Quantity | Value | Units | Method | Reference | Comment |
---|---|---|---|---|---|
ΔvapH° | 6.60 ± 0.31 | kcal/mol | CC-SB | Kipnis, 1962 | MS |
ΔvapH° | 6.50 | kcal/mol | N/A | Spice, Staveley, et al., 1955 | AC |
Enthalpy of vaporization
ΔvapH (kcal/mol) | Temperature (K) | Reference | Comment |
---|---|---|---|
7.12 | 344. | Baev, 1970 | Based on data from 277. to 412. K.; AC |
7.05 | 265. | Stull, 1947 | Based on data from 250. to 315. K.; AC |
Antoine Equation Parameters
log10(P) = A − (B / (T + C))
P = vapor pressure (atm)
T = temperature (K)
View plot Requires a JavaScript / HTML 5 canvas capable browser.
Temperature (K) | A | B | C | Reference | Comment |
---|---|---|---|---|---|
250. to 315.7 | 4.63164 | 1409.037 | -11.637 | Stull, 1947 | Coefficents calculated by NIST from author's data. |

References

Chase, 1998
Chase, M.W., Jr.,
NIST-JANAF Themochemical Tables, Fourth Edition,
J. Phys. Chem. Ref. Data, Monograph 9, 1998, 1-1951. [all data]
Martinho Simões
Martinho Simões, J.A.,
Private communication (see http://webbook.nist.gov/chemistry/om/). [all data]
Fischer, Cotton, et al., 1957
Fischer, A.K.; Cotton, F.A.; Wilkinson, G.,
J. Am. Chem. Soc., 1957, 79, 2044. [all data]
Pedley and Rylance, 1977
Pedley, J.B.; Rylance, J.,
Computer Analysed Thermochemical Data: Organic and Organometallic Compounds, University of Sussex, Brigton, 1977. [all data]
Cox and Pilcher, 1970
Cox, J.D.; Pilcher, G.,
Thermochemistry of Organic and Organometallic Compounds
in Academic Press, New York, 1970. [all data]
Hunter and Lias, 1998
Hunter, E.P.; Lias, S.G.,
Evaluated Gas Phase Basicities and Proton Affinities of Molecules: An Update,
J. Phys. Chem. Ref. Data, 1998, 27, 3, 413-656, https://doi.org/10.1063/1.556018
. [all data]
Reutt, Wang, et al., 1986
Reutt, J.E.; Wang, L.S.; Lee, Y.T.; Shirley, D.A.,
Molecular beam photoelectron spectroscopy of Ni(CO)4,
Chem. Phys. Lett., 1986, 126, 399. [all data]
Clements and Sale, 1976
Clements, P.J.; Sale, F.R.,
A mass spectrometric study of nickel tetracarbonyl, iron pentacarbonyl and binary mixtures of these compounds,
Metall. Trans. B:, 1976, 7, 171. [all data]
Hillier, Guest, et al., 1974
Hillier, I.H.; Guest, M.F.; Higginson, B.R.; Lloyd, D.R.,
Ab initio calculations of transition metal complexes V. The electronic structure and He(I) photoelectron spectra of Fe(CO)2(NO)2, Co(CO)3NO and Ni(CO)4,
Mol. Phys., 1974, 27, 215. [all data]
Distefano, 1970
Distefano, G.,
Photoionization study of Fe(CO)5 and Ni(CO)4,
J. Res. NBS, 1970, 74A, 233. [all data]
Lloyd and Schlag, 1969
Lloyd, D.R.; Schlag, E.W.,
Photoionization studies of metal carbonyls. I. Ionization potentials and the bonding in group VI metal hexacarbonyls and in mononuclear carbonyls and nitrosyl carbonyls of iron, cobalt, and nickel,
Inorg. Chem., 1969, 8, 2544. [all data]
Junk and Svec, 1968
Junk, G.A.; Svec, H.J.,
Energetics of the ionization and dissociation of Ni(CO)4, Fe(CO)5, Cr(CO)6, Mo(CO)6 and W(CO)6,
Z. Naturforsch., 1968, 23b, 1. [all data]
Schildcrout, Pressley, et al., 1967
Schildcrout, S.M.; Pressley, G.A., Jr.; Stafford, F.E.,
Pyrolysis and molecular-beam mass spectrum of tetracarhonylnickel(0),
J. Am. Chem. Soc., 1967, 89, 1617. [all data]
Bidinosti and McIntyre, 1967
Bidinosti, D.R.; McIntyre, N.S.,
Electron-impact study of some binary metal carbonyls,
Can. J. Chem., 1967, 45, 641. [all data]
Winters and Kiser, 1964
Winters, R.E.; Kiser, R.W.,
A mass spectrometric investigation of nickel tetracarbonyl and iron pentacarbonyl,
Inorg. Chem., 1964, 3, 699. [all data]
Vilesov and Kurbatov, 1961
Vilesov, F.I.; Kurbatov, B.L.,
Photoionization of esters and metal carbonyis in the gaseous phase,
Dokl. Akad. Nauk SSSR, 1961, 140, 1364, In original 792. [all data]
Khan, Steele, et al., 1995
Khan, F.A.; Steele, D.L.; Armentrout, P.B.,
Ligand effects in organometallic thermochemistry: The sequential bond energies of Ni(CO)x+ and Ni(N2)x+ (x = 1-4) and Ni(NO)x+ (x = 1-3) [Data derived from reported bond energies taking value of 8.273±0.046 eV for IE[Ni(CO)4]],
J. Phys. Chem., 1995, 99, 7819. [all data]