nickel dibromide
- Formula: Br2Ni
- Molecular weight: 218.501
- IUPAC Standard InChIKey: IPLJNQFXJUCRNH-UHFFFAOYSA-L
- CAS Registry Number: 13462-88-9
- Chemical structure:
View 3d structure (requires JavaScript / HTML 5) - Other names: Nickel bromide

Phase change data

Data compiled by: William E. Acree, Jr., James S. Chickos
Quantity | Value | Units | Method | Reference | Comment |
---|---|---|---|---|---|
ΔsubH° | 226. ± 1.0 | kJ/mol | N/A | Bardi, Brunetti, et al., 1997 |
Enthalpy of sublimation
ΔsubH (kJ/mol) | Temperature (K) | Method | Reference | Comment |
---|---|---|---|---|
207. ± 4.0 | 841. | TE | Bardi, Brunetti, et al., 1997 | Based on data from 714. to 969. K. |

Gas phase ion energetics data

Data compiled by: Sharon G. Lias, Rhoda D. Levin, and Sherif A. Kafafi
Ionization energy determinations
IE (eV) | Method | Reference | Comment |
---|---|---|---|
10.3 | PE | MacNaughton, Bloor, et al., 1981 | Vertical value |

References

Bardi, Brunetti, et al., 1997
Bardi, Gianpiero; Brunetti, Bruno; Ciccariello, Erasmo; Piacente, Vincenzo,
Vapour pressures and sublimation enthalpies of cobalt and nickel dibromides,
Journal of Alloys and Compounds, 1997, 247, 1-2, 202-205, https://doi.org/10.1016/S0925-8388(96)02578-9
. [all data]
MacNaughton, Bloor, et al., 1981
MacNaughton, R.M.; Bloor, J.E.; Sherrod, R.E.; Schweitzer, G.K.,
The He(I) photoelectron psectra of some gaseous 3d-transition metal dihalides,
J. Electron Spectrosc. Relat. Phenom., 1981, 22, 1. [all data]