phosphorus triiodide
- Formula: I3P
- Molecular weight: 411.68717
- IUPAC Standard InChIKey: PZHNNJXWQYFUTD-UHFFFAOYSA-N
- CAS Registry Number: 13455-01-1
- Chemical structure:
View 3d structure (requires JavaScript / HTML 5) - Permanent link for this species. Use this link for bookmarking this species for future reference.

Reaction thermochemistry data

Data compiled by: John E. Bartmess
Individual Reactions
+
= I4P-
Quantity | Value | Units | Method | Reference | Comment |
---|---|---|---|---|---|
ΔrH° | 54.0 ± 7.9 | kJ/mol | CIDT | Heil, Check, et al., 2002 | gas phase |

Gas phase ion energetics data

Data compiled by: Sharon G. Lias, Rhoda D. Levin, and Sherif A. Kafafi
Ionization energy determinations
IE (eV) | Method | Reference | Comment |
---|---|---|---|
9.15 | PE | Berkosky, Ellison, et al., 1973 | Vertical value |

Ion clustering data

Data compiled by: John E. Bartmess
Clustering reactions
+
= I4P-
Quantity | Value | Units | Method | Reference | Comment |
---|---|---|---|---|---|
ΔrH° | 54.0 ± 7.9 | kJ/mol | CIDT | Heil, Check, et al., 2002 | gas phase |

Vibrational and/or electronic energy levels

Data compiled by: Takehiko Shimanouchi
Symmetry: C3ν Symmetry Number σ = 3
Sym. | No | Approximate | Selected Freq. | Infrared | Raman | Comments | ||||
---|---|---|---|---|---|---|---|---|---|---|
Species | type of mode | Value | Rating | Value | Phase | Value | Phase | |||
a1 | 1 | Sym str | 303 | D | 306 M | solid solid | 303 p | solid solid solid | ||
a1 | 2 | Sym deform | 111 | D | 112 VW | solid solid | 111 p | solid solid solid | ||
e | 3 | Deg str | 325 | D | 328 VS | solid solid | 325 dp | solid solid solid | ||
e | 4 | Deg deform | 79 | D | 80 VW b | solid solid | 79 dp | solid solid solid | ||
Source: Shimanouchi, 1972

References

Heil, Check, et al., 2002
Heil, T.E.; Check, C.E.; Lobring, K.C.; Sunderlin, L.S.,
The thermochemistry of phosphorus tetrahalide anions,
J. Phys. Chem. A, 2002, 106, 42, 10043-10048, https://doi.org/10.1021/jp021386y
. [all data]
Berkosky, Ellison, et al., 1973
Berkosky, J.L.; Ellison, F.O.; Lee, T.H.; Rabalais, J.W.,
Model for calculating spin-orbit interactions with applications to photoelectron spectroscopy,
J. Chem. Phys., 1973, 59, 5342. [all data]
Shimanouchi, 1972
Shimanouchi, T.,
Tables of Molecular Vibrational Frequencies Consolidated Volume II,
J. Phys. Chem. Ref. Data, 1972, 6, 3, 993-1102. [all data]