cesium perchlorate
- Formula: ClHO4·Cs
- Molecular weight: 233.364
- IUPAC Standard InChIKey: WKDKOOITVYKILI-UHFFFAOYSA-M
- CAS Registry Number: 13454-84-7
- Chemical structure:
View 3d structure (requires JavaScript / HTML 5) - Permanent link for this species. Use this link for bookmarking this species for future reference.

Gas phase ion energetics data

Data compiled by: Sharon G. Lias, Rhoda D. Levin, and Sherif A. Kafafi
Appearance energy determinations
Ion | AE (eV) | Other Products | Method | Reference | Comment |
---|---|---|---|---|---|
Cs+ | 8.8 ± 0.5 | ? | EI | Nikolaev, Ovchinnikov, et al., 1980 |

References

Nikolaev, Ovchinnikov, et al., 1980
Nikolaev, E.N.; Ovchinnikov, K.V.; Semenov, G.A.,
Mass-spectrometric study of the composition of the vapor above alkali-metal perchlorates,
J. Gen. Chem. USSR, 1980, 51, 1460. [all data]