Fluoromethylene
- Formula: CHF
- Molecular weight: 32.0170
- IUPAC Standard InChIKey: YUCFVHQCAFKDQG-UHFFFAOYSA-N
- CAS Registry Number: 13453-52-6
- Chemical structure:
View 3d structure (requires JavaScript / HTML 5) - Permanent link for this species. Use this link for bookmarking this species for future reference.

Gas phase thermochemistry data

Quantity | Value | Units | Method | Reference | Comment |
---|---|---|---|---|---|
ΔfH°gas | 125.52 | kJ/mol | Review | Chase, 1998 | Data last reviewed in December, 1969 |
Quantity | Value | Units | Method | Reference | Comment |
S°gas,1 bar | 223.35 | J/mol*K | Review | Chase, 1998 | Data last reviewed in December, 1969 |
Gas Phase Heat Capacity (Shomate Equation)
Cp° = A + B*t + C*t2 + D*t3 +
E/t2
H° − H°298.15= A*t + B*t2/2 +
C*t3/3 + D*t4/4 − E/t + F − H
S° = A*ln(t) + B*t + C*t2/2 + D*t3/3 −
E/(2*t2) + G
Cp = heat capacity (J/mol*K)
H° = standard enthalpy (kJ/mol)
S° = standard entropy (J/mol*K)
t = temperature (K) / 1000.
View plot Requires a JavaScript / HTML 5 canvas capable browser.
Temperature (K) | 298. to 2000. | 2000. to 6000. |
---|---|---|
A | 21.86387 | 12.52798 |
B | 43.57594 | 24.19883 |
C | -21.84111 | -3.532459 |
D | 4.225464 | 0.164806 |
E | 0.137095 | 29.49502 |
F | 117.7097 | 157.2439 |
G | 238.5165 | 261.6289 |
H | 125.5200 | 125.5200 |
Reference | Chase, 1998 | Chase, 1998 |
Comment | Data last reviewed in December, 1969 | Data last reviewed in December, 1969 |

Reaction thermochemistry data

Data compiled by: John E. Bartmess
Individual Reactions
(CAS Reg. No. 61923-51-1 • 4294967295) +
= CAS Reg. No. 61923-51-1
By formula: (CAS Reg. No. 61923-51-1 • 4294967295CHF) + CHF = CAS Reg. No. 61923-51-1
Quantity | Value | Units | Method | Reference | Comment |
---|---|---|---|---|---|
ΔrH° | 90. ± 15. | kJ/mol | N/A | Poutsma, Paulino, et al., 1997 | gas phase; Relative to MeOH at ΔGacid=375.1 |
ΔrH° | 95.0 ± 9.2 | kJ/mol | CIDT | Poutsma, Paulino, et al., 1997 | gas phase |

Gas phase ion energetics data

Data evaluated as indicated in comments:
HL - Edward P. Hunter and Sharon G. Lias
L - Sharon G. Lias
Data compiled as indicated in comments:
LL - Sharon G. Lias and Joel F. Liebman
LBLHLM - Sharon G. Lias, John E. Bartmess, Joel F. Liebman, John L. Holmes, Rhoda D. Levin, and W. Gary Mallard
B - John E. Bartmess
Quantity | Value | Units | Method | Reference | Comment |
---|---|---|---|---|---|
IE (evaluated) | 10.06 ± 0.05 | eV | N/A | N/A | L |
Quantity | Value | Units | Method | Reference | Comment |
Proton affinity (review) | 797.9 | kJ/mol | N/A | Hunter and Lias, 1998 | HL |
Quantity | Value | Units | Method | Reference | Comment |
Gas basicity | 763.8 | kJ/mol | N/A | Hunter and Lias, 1998 | HL |
Electron affinity determinations
EA (eV) | Method | Reference | Comment |
---|---|---|---|
0.5420 ± 0.0050 | LPES | Gilles, Ervin, et al., 1992 | Triplet state of neutral: 14.9±0.4 kcal/mol higher than singlet; B |
0.5570 ± 0.0050 | LPES | Murray, Leopold, et al., 1988 | Singlet-triplet splitting in neutral 11.4±0.3 kcal/mol; B |
Ionization energy determinations
IE (eV) | Method | Reference | Comment |
---|---|---|---|
10.06 ± 0.05 | LS | Irikura, Hudgens, et al., 1995 | LL |
10.4 | EI | Goto, Nakamura, et al., 1994 | LL |
10.49 | DER | Lias, Karpas, et al., 1985 | LBLHLM |
Appearance energy determinations
Ion | AE (eV) | Other Products | Method | Reference | Comment |
---|---|---|---|---|---|
CF+ | 16.6 | H | EI | Goto, Nakamura, et al., 1994 | LL |
CH+ | 24.2 | F | EI | Goto, Nakamura, et al., 1994 | LL |

References

Chase, 1998
Chase, M.W., Jr.,
NIST-JANAF Themochemical Tables, Fourth Edition,
J. Phys. Chem. Ref. Data, Monograph 9, 1998, 1-1951. [all data]
Poutsma, Paulino, et al., 1997
Poutsma, J.C.; Paulino, J.A.; Squires, R.R.,
Absolute Heats of Formation of CHCl, CHF, and CClF. A Gas-Phase Experimental and G2 Theoretical Study.,
J. Phys. Chem. A, 1997, 101, 29, 5327, https://doi.org/10.1021/jp970778f
. [all data]
Hunter and Lias, 1998
Hunter, E.P.; Lias, S.G.,
Evaluated Gas Phase Basicities and Proton Affinities of Molecules: An Update,
J. Phys. Chem. Ref. Data, 1998, 27, 3, 413-656, https://doi.org/10.1063/1.556018
. [all data]
Gilles, Ervin, et al., 1992
Gilles, M.K.; Ervin, K.M.; Ho, J.; Lineberger, W.C.,
Negative Ion Photoelectron Spectroscopy of HCF-, HCCl-, HCBr-, and HCI- - Photoelectron Angular Distributions and Neutral Triplet Excitation,
J. Phys. Chem., 1992, 96, 3, 1130, https://doi.org/10.1021/j100182a021
. [all data]
Murray, Leopold, et al., 1988
Murray, K.K.; Leopold, D.G.; Miller, T.M.; Lineberger, W.C.,
Photoelectron Spectroscopy of the Halocarbene Anions HCF-, HCCl-, HCBr-, HCI-, CF2-, and CCl2-,
J. Chem. Phys., 1988, 89, 9, 5442, https://doi.org/10.1063/1.455596
. [all data]
Irikura, Hudgens, et al., 1995
Irikura, K.K.; Hudgens, J.W.; Johnson, R.D., III,
Spectroscopy of the fluoromethylene radicals HCF and DCF by 2+1 resonance enhanced multiphoton ionization spectroscopy and by ab initio calculation,
J. Chem. Phys., 1995, 103, 1303. [all data]
Goto, Nakamura, et al., 1994
Goto, M.; Nakamura, K.; Toyoda, H.; Sugai, H.,
Cross section measurements for electron-impact dissociation of CHF3 into neutral and ionic fragments,
Jpn. J. Appl. Phys. Part 1, 1994, 33, 3602. [all data]
Lias, Karpas, et al., 1985
Lias, S.G.; Karpas, Z.; Liebman, J.F.,
Halomethylenes: Effects of halogen substitution on absolute heats of formation,
J. Am. Chem. Soc., 1985, 107, 6089. [all data]