Tetradecamethylcycloheptasilane
- Formula: C14H42Si7
- Molecular weight: 407.0818
- IUPAC Standard InChIKey: GRYINNPXWBBEBV-UHFFFAOYSA-N
- CAS Registry Number: 13452-94-3
- Chemical structure:
View 3d structure (requires JavaScript / HTML 5) - Permanent link for this species. Use this link for bookmarking this species for future reference.

Gas phase ion energetics data

Data compiled by: Henry M. Rosenstock, Keith Draxl, Bruce W. Steiner, and John T. Herron
Ionization energy determinations
IE (eV) | Method | Reference |
---|---|---|
7.39 ± 0.01 | EI | Pitt, Bursey, et al., 1970 |

References

Pitt, Bursey, et al., 1970
Pitt, C.G.; Bursey, M.M.; Rogerson, P.F.,
Catenates of the group IV elements. Correlation of σ electron energies,
J. Am. Chem. Soc., 1970, 92, 519. [all data]