Decamethyl cyclopentasilane
- Formula: C10H30Si5
- Molecular weight: 290.7727
- IUPAC Standard InChIKey: VGLVSMNWXDHPHX-UHFFFAOYSA-N
- CAS Registry Number: 13452-92-1
- Chemical structure:
View 3d structure (requires JavaScript / HTML 5) - Other names: Cyclopentasilane,decamethyl-

Gas phase ion energetics data

Data compiled as indicated in comments:
LLK - Sharon G. Lias, Rhoda D. Levin, and Sherif A. Kafafi
RDSH - Henry M. Rosenstock, Keith Draxl, Bruce W. Steiner, and John T. Herron
Ionization energy determinations
IE (eV) | Method | Reference | Comment |
---|---|---|---|
7.18 ± 0.01 | EI | Pitt, Bursey, et al., 1970 | RDSH |
7.94 | PE | Bock and Ensslin, 1971 | Vertical value; LLK |

References

Pitt, Bursey, et al., 1970
Pitt, C.G.; Bursey, M.M.; Rogerson, P.F.,
Catenates of the group IV elements. Correlation of σ electron energies,
J. Am. Chem. Soc., 1970, 92, 519. [all data]
Bock and Ensslin, 1971
Bock, H.; Ensslin, W.,
Bond-bond interaction in polysilanes,
Angew. Chem. Int. Ed. Engl., 1971, 10, 404. [all data]