Tellurium monoxide
- Formula: OTe
- Molecular weight: 143.60
- IUPAC Standard InChIKey: QGMWCJPYHVWVRR-UHFFFAOYSA-N
- CAS Registry Number: 13451-17-7
- Chemical structure:
View 3d structure (requires JavaScript / HTML 5) - Permanent link for this species. Use this link for bookmarking this species for future reference.

Gas phase ion energetics data

Data compiled as indicated in comments:
LLK - Sharon G. Lias, Rhoda D. Levin, and Sherif A. Kafafi
RDSH - Henry M. Rosenstock, Keith Draxl, Bruce W. Steiner, and John T. Herron
B - John E. Bartmess
Electron affinity determinations
EA (eV) | Method | Reference | Comment |
---|---|---|---|
1.697 ± 0.022 | LPES | Freidhoff, Coe, et al., 1986 | B |
Ionization energy determinations
IE (eV) | Method | Reference | Comment |
---|---|---|---|
9.4 ± 0.5 | EI | Staley, 1970 | RDSH |
8.72 | PE | Potts and Williams, 1976 | Vertical value; LLK |

Constants of diatomic molecules

Data compiled by: Klaus P. Huber and Gerhard H. Herzberg
Data collected through November, 1977
Symbol | Meaning |
---|---|
State | electronic state and / or symmetry symbol |
Te | minimum electronic energy (cm-1) |
ωe | vibrational constant – first term (cm-1) |
ωexe | vibrational constant – second term (cm-1) |
ωeye | vibrational constant – third term (cm-1) |
Be | rotational constant in equilibrium position (cm-1) |
αe | rotational constant – first term (cm-1) |
γe | rotation-vibration interaction constant (cm-1) |
De | centrifugal distortion constant (cm-1) |
βe | rotational constant – first term, centrifugal force (cm-1) |
re | internuclear distance (Å) |
Trans. | observed transition(s) corresponding to electronic state |
ν00 | position of 0-0 band (units noted in table) |
State | Te | ωe | ωexe | ωeye | Be | αe | γe | De | βe | re | Trans. | ν00 |
---|---|---|---|---|---|---|---|---|---|---|---|---|
Fragment of an absorption system in the region 32700 - 36000 cm-1; it is not certain that these bands are due to TeO. | ||||||||||||
↳Shin-Piaw, 1938 | ||||||||||||
A2 1 | [28719] | 1 | [0.2771] 2 | (0.004) | [2E-7] | [2.067] | A2 → X2 R | 27641.95 Z | ||||
↳missing citation; missing citation | ||||||||||||
A1 0+ | (28212) | [444.95] Z | 3 | 0.2760 2 4 | 0.0052 | 4E-7 | 2.071 | A1 ↔ X1 R | 28037.04 Z | |||
↳missing citation; missing citation | ||||||||||||
Unclassified emission bands 16000 - 20000 cm-1. | ||||||||||||
↳Haranath, Rao, et al., 1959 | ||||||||||||
State | Te | ωe | ωexe | ωeye | Be | αe | γe | De | βe | re | Trans. | ν00 |
X2 1 | 679 5 | 798.06 Z | 4.00 | 0.3564 6 | 0.00236 | 3E-7 | 1.8224 | |||||
X1 0+ | 0 | 797.11 Z | 4.00 | 0.3554 | 0.00237 | 2.7E-7 | 1.8250 |

References

Freidhoff, Coe, et al., 1986
Freidhoff, C.B.; Coe, J.V.; Snodgrass, J.T.; McHugh, K.M.; Bowen, K.H.,
Negative ion photoelectron spectroscopy of TeO-,
Chem. Phys. Lett., 1986, 124, 268. [all data]
Staley, 1970
Staley, H.G.,
Mass-spectrometric Knudsen-cell study of the gaseous oxides of tellurium,
J. Chem. Phys., 1970, 52, 4311. [all data]
Potts and Williams, 1976
Potts, A.W.; Williams, T.A.,
The He I photoelectron spectrum of TeO,
Chem. Phys. Lett., 1976, 42, 550. [all data]
Shin-Piaw, 1938
Shin-Piaw, C.,
Spectres de bandes du selenium, du tellure et de leurs oxydes dans l'ultra-violet,
Ann. Phys. (Paris), 1938, 10, 173-175. [all data]
Haranath, Rao, et al., 1959
Haranath, P.B.V.; Rao, P.T.; Sivaramamurty, V.,
New emission spectrum of the TeO molecule,
Z. Phys., 1959, 155, 507. [all data]
Chandler, Hurst, et al., 1965
Chandler, G.G.; Hurst, H.J.; Barrow, R.F.,
Rotational analysis of the A-X system of tellurium monoxide,
Proc. Phys. Soc. London, 1965, 86, 105. [all data]
Barrow and Hitchings, 1972
Barrow, R.F.; Hitchings, M.R.,
The Ω=1,0+ separation in the 3Σ- ground state of gaseous TeO,
J. Phys. B:, 1972, 5, 132. [all data]