strontium wolframate

Gas phase ion energetics data

Data compiled by: Henry M. Rosenstock, Keith Draxl, Bruce W. Steiner, and John T. Herron

Ionization energy determinations

IE (eV) Method Reference
9.4EIVerhaegen, Colin, et al., 1965

References

Verhaegen, Colin, et al., 1965
Verhaegen, G.; Colin, R.; Exsteen, G.; Drowart, J., Mass spectrometric determination of the stability of gaseous molybdites, tungstites, molybdates and tungstates of magnesium, calcium, strontium and tin, J. Chem. Soc. Faraday Trans., 1965, 61, 1372. [all data]