manganese dibromide
- Formula: Br2Mn
- Molecular weight: 214.746
- IUPAC Standard InChIKey: RJYMRRJVDRJMJW-UHFFFAOYSA-L
- CAS Registry Number: 13446-03-2
- Chemical structure:
View 3d structure (requires JavaScript / HTML 5) - Other names: Manganese bromide

Reaction thermochemistry data

Data compiled by: José A. Martinho Simões
Individual Reactions
C12H7MnO5 (cr) + 1.5 (g) =
(g) +
(cr) + 5
(g)
By formula: C12H7MnO5 (cr) + 1.5Br2 (g) = C7H7Br (g) + Br2Mn (cr) + 5CO (g)
Quantity | Value | Units | Method | Reference | Comment |
---|---|---|---|---|---|
ΔrH° | -194.5 ± 7.8 | kJ/mol | HAL-HFC | Connor, Zafarani-Moattar, et al., 1982 |
C6F3MnO5 (cr) + 1.5 (g) =
(cr) + 5
(g) +
(g)
By formula: C6F3MnO5 (cr) + 1.5Br2 (g) = Br2Mn (cr) + 5CO (g) + CBrF3 (g)
Quantity | Value | Units | Method | Reference | Comment |
---|---|---|---|---|---|
ΔrH° | -173. ± 3. | kJ/mol | HAL-HFC | Connor, Zafarani-Moattar, et al., 1982 |
C7F3MnO6 (cr) + 1.5 (g) =
(cr) + 6
(g) +
(g)
By formula: C7F3MnO6 (cr) + 1.5Br2 (g) = Br2Mn (cr) + 6CO (g) + CBrF3 (g)
Quantity | Value | Units | Method | Reference | Comment |
---|---|---|---|---|---|
ΔrH° | -161. ± 2. | kJ/mol | HAL-HFC | Connor, Zafarani-Moattar, et al., 1982 |
(cr) + 1.5
(g) =
(cr) + 5
(g) +
(g)
By formula: C6H3MnO5 (cr) + 1.5Br2 (g) = Br2Mn (cr) + 5CO (g) + CH3Br (g)
Quantity | Value | Units | Method | Reference | Comment |
---|---|---|---|---|---|
ΔrH° | -209. ± 3. | kJ/mol | HAL-HFC | Connor, Zafarani-Moattar, et al., 1982 |
(cr) + 1.5
(g) =
(cr) + 6
(g) +
(g)
By formula: C7H3MnO6 (cr) + 1.5Br2 (g) = Br2Mn (cr) + 6CO (g) + CH3Br (g)
Quantity | Value | Units | Method | Reference | Comment |
---|---|---|---|---|---|
ΔrH° | -161. ± 5. | kJ/mol | HAL-HFC | Connor, Zafarani-Moattar, et al., 1982 |
(cr) + 2
(g) = 2
(cr) + 10
(g)
By formula: C10Mn2O10 (cr) + 2Br2 (g) = 2Br2Mn (cr) + 10CO (g)
Quantity | Value | Units | Method | Reference | Comment |
---|---|---|---|---|---|
ΔrH° | -263.6 ± 8.2 | kJ/mol | HAL-HFC | Connor, Zafarani-Moattar, et al., 1982 |
By formula: C5BrMnO5 (cr) + 0.5Br2 (g) = Br2Mn (cr) + 5CO (g)
Quantity | Value | Units | Method | Reference | Comment |
---|---|---|---|---|---|
ΔrH° | 9.9 ± 1.8 | kJ/mol | HAL-HFC | Connor, Zafarani-Moattar, et al., 1982 |

Gas phase ion energetics data

Data compiled by: Sharon G. Lias, Rhoda D. Levin, and Sherif A. Kafafi
Ionization energy determinations
IE (eV) | Method | Reference | Comment |
---|---|---|---|
10.3 | PE | MacNaughton, Bloor, et al., 1981 | Vertical value |

References

Connor, Zafarani-Moattar, et al., 1982
Connor, J.A.; Zafarani-Moattar, M.T.; Bickerton, J.; El-Saied, N.I.; Suradi, S.; Carson, R.; Al Takkhin, G.; Skinner, H.A.,
Organomet., 1982, 1, 1166. [all data]
MacNaughton, Bloor, et al., 1981
MacNaughton, R.M.; Bloor, J.E.; Sherrod, R.E.; Schweitzer, G.K.,
The He(I) photoelectron psectra of some gaseous 3d-transition metal dihalides,
J. Electron Spectrosc. Relat. Phenom., 1981, 22, 1. [all data]