Diphosphine
- Formula: H4P2
- Molecular weight: 65.97928
- IUPAC Standard InChIKey: VURFVHCLMJOLKN-UHFFFAOYSA-N
- CAS Registry Number: 13445-50-6
- Chemical structure:
View 3d structure (requires JavaScript / HTML 5) - Permanent link for this species. Use this link for bookmarking this species for future reference.

Reaction thermochemistry data

Data compiled by: John E. Bartmess
Individual Reactions
H3P2- + =
Quantity | Value | Units | Method | Reference | Comment |
---|---|---|---|---|---|
ΔrH° | <1574.9 | kJ/mol | Acid | Smyth and Brauman, 1972 | gas phase; PH2- + PH3 ->. |

Gas phase ion energetics data

Data compiled as indicated in comments:
B - John E. Bartmess
LLK - Sharon G. Lias, Rhoda D. Levin, and Sherif A. Kafafi
RDSH - Henry M. Rosenstock, Keith Draxl, Bruce W. Steiner, and John T. Herron
Ionization energy determinations
IE (eV) | Method | Reference | Comment |
---|---|---|---|
8.8 | PE | Elbel, Dieck, et al., 1976 | LLK |
9.17 ± 0.05 | EI | Fehlner and Callen, 1968 | RDSH |
8.7 ± 0.3 | EI | Wada and Kiser, 1964 | RDSH |
10.6 ± 0.3 | EI | Saalfeld and Svec, 1963 | RDSH |
9.69 | PE | Elbel, Dieck, et al., 1976 | Vertical value; LLK |
Appearance energy determinations
Ion | AE (eV) | Other Products | Method | Reference | Comment |
---|---|---|---|---|---|
PH+ | 17.4 ± 0.5 | ? | EI | Fehlner and Callen, 1968 | RDSH |
P2H+ | 14.6 ± 0.3 | ? | EI | Fehlner and Callen, 1968 | RDSH |
P2H+ | 13.2 | ? | EI | Wada and Kiser, 1964 | RDSH |
P2H+ | 13.6 ± 0.3 | ? | EI | Saalfeld and Svec, 1963 | RDSH |
PH2+ | 15.3 ± 0.5 | ? | EI | Fehlner and Callen, 1968 | RDSH |
PH2+ | 12.5 ± 0.2 | ? | EI | Saalfeld and Svec, 1964 | RDSH |
P2H2+ | 11.1 ± 0.2 | H2 | EI | Fehlner and Callen, 1968 | RDSH |
P2H2+ | 10.5 | H2 | EI | Wada and Kiser, 1964 | RDSH |
P2H2+ | 12.7 ± 0.3 | H2 | EI | Saalfeld and Svec, 1963 | RDSH |
P2H3+ | 12.2 ± 0.2 | H | EI | Fehlner and Callen, 1968 | RDSH |
P2H3+ | 11.3 ± 0.3 | H | EI | Saalfeld and Svec, 1963 | RDSH |
P+ | 19.4 ± 0.5 | ? | EI | Fehlner and Callen, 1968 | RDSH |
P+ | 16.7 ± 0.3 | ? | EI | Saalfeld and Svec, 1963 | RDSH |
P2+ | 13.2 ± 0.2 | ? | EI | Fehlner and Callen, 1968 | RDSH |
P2+ | 12.2 | ? | EI | Wada and Kiser, 1964 | RDSH |
P2+ | 13.7 ± 0.3 | ? | EI | Saalfeld and Svec, 1963 | RDSH |
De-protonation reactions
H3P2- + =
Quantity | Value | Units | Method | Reference | Comment |
---|---|---|---|---|---|
ΔrH° | <1574.9 | kJ/mol | Acid | Smyth and Brauman, 1972 | gas phase; PH2- + PH3 ->.; B |

References

Smyth and Brauman, 1972
Smyth, K.C.; Brauman, J.I.,
Photodetachment of electrons from phosphide ion the electron affinity of PH2-,
J. Chem. Phys., 1972, 56, 1132. [all data]
Elbel, Dieck, et al., 1976
Elbel, S.; Dieck, H.t.; Becker, G.; Ensslin, W.,
Photoelectron spectra of group 5 compounds. II. Conformational analysis of diphosphine (P2H4),
Inorg. Chem., 1976, 15, 1235. [all data]
Fehlner and Callen, 1968
Fehlner, T.P.; Callen, R.B.,
Mass spectrometry of phosphorus hydrides,
Advan. Chem. Ser., 1968, 72, 181. [all data]
Wada and Kiser, 1964
Wada, Y.; Kiser, R.W.,
Mass spectrometric study of phosphine and diphosphine,
Inorg. Chem., 1964, 3, 174. [all data]
Saalfeld and Svec, 1963
Saalfeld, F.E.; Svec, H.J.,
The mass spectra of volatile hydrides. II. Some higher hydrides of the group IVB and VB elements,
Inorg. Chem., 1963, 2, 50. [all data]
Saalfeld and Svec, 1964
Saalfeld, F.E.; Svec, H.J.,
Mass spectra of volatile hydrides. III. Silylphosphine,
Inorg. Chem., 1964, 3, 1442. [all data]