1-Naphthalenamine
- Formula: C10H9N
- Molecular weight: 143.1852
- IUPAC Standard InChIKey: RUFPHBVGCFYCNW-UHFFFAOYSA-N
- CAS Registry Number: 134-32-7
- Chemical structure:
View 3d structure (requires JavaScript / HTML 5) - Species with the same structure:
- Other names: 1-Naphthylamine; α-Aminonaphthalene; α-Naphthylamine; C.I. Azoic Diazo Component 114; C.I. 37265; Fast Garnet Base B; Naphthalidam; Naphthalidine; 1-Aminonaphthalene; 1-Naphthalamine; Alfanaftilamina; Alfa-naftyloamina; 1-Aminonaftalen; Fast garnet B base; α-Naftalamin; 1-Naftilamina; α-Naftylamin; 1-Naftylamin; 1-Naftylamine; 1-Naphthylamin; Rcra waste number U167; UN 2077; Naphthalen-1-ylamine

Condensed phase thermochemistry data

Data compiled by: Hussein Y. Afeefy, Joel F. Liebman, and Stephen E. Stein
Quantity | Value | Units | Method | Reference | Comment |
---|---|---|---|---|---|
ΔfH°solid | 92.5 | kJ/mol | Ccb | Pushin, 1954 | Author's hf298_condensed=19.6 kcal/mol |
ΔfH°solid | 87.0 | kJ/mol | Ccb | Schmidt and Becker, 1933 | |
ΔfH°solid | 91.6 | kJ/mol | Ccb | Lemoult, 1907 | |
Quantity | Value | Units | Method | Reference | Comment |
ΔcH°solid | -5285.9 ± 5.3 | kJ/mol | Ccb | Balcan, Arzik, et al., 1996 | |
ΔcH°solid | -5314. | kJ/mol | Ccb | Pushin, 1954 | Author's hf298_condensed=19.6 kcal/mol |
ΔcH°solid | -5308.49 | kJ/mol | Ccb | Schmidt and Becker, 1933 | |
ΔcH°solid | -5289.0 ± 5.4 | kJ/mol | Ccb | Milone and Rossignoli, 1932 | Reanalyzed by Cox and Pilcher, 1970, Original value = -5294.22 kJ/mol |
ΔcH°solid | -5312.8 | kJ/mol | Ccb | Lemoult, 1907 |

Phase change data

Data compiled as indicated in comments:
BS - Robert L. Brown and Stephen E. Stein
TRC - Thermodynamics Research Center, NIST Boulder Laboratories, Chris Muzny director
AC - William E. Acree, Jr., James S. Chickos
Quantity | Value | Units | Method | Reference | Comment |
---|---|---|---|---|---|
Tboil | 574.0 | K | N/A | Weast and Grasselli, 1989 | BS |
Tboil | 573.15 | K | N/A | Stillmann and Swain, 1899 | Uncertainty assigned by TRC = 2. K; TRC |
Tboil | 573.95 | K | N/A | Perkin, 1896 | Uncertainty assigned by TRC = 1.5 K; TRC |
Tboil | 512.1 | K | N/A | Hofmann, 1844 | Uncertainty assigned by TRC = 27.77 K; Identity uncertain. Name given was leucol. Analysis corresponds to C10H9N. Extracted from coal naphtha along with aniline. May be mixture with aniline.; TRC |
Quantity | Value | Units | Method | Reference | Comment |
Tfus | 322. ± 2. | K | AVG | N/A | Average of 16 out of 17 values; Individual data points |
Quantity | Value | Units | Method | Reference | Comment |
ΔvapH° | 73.3 ± 0.4 | kJ/mol | GS | Verevkin, Georgieva, et al., 2007 | Based on data from 323. to 353. K.; AC |
Quantity | Value | Units | Method | Reference | Comment |
ΔsubH° | 88.1 ± 0.4 | kJ/mol | GS | Verevkin, Georgieva, et al., 2007 | Based on data from 290. to 320. K.; AC |
Enthalpy of vaporization
ΔvapH (kJ/mol) | Temperature (K) | Method | Reference | Comment |
---|---|---|---|---|
63.6 | 392. | A | Stephenson and Malanowski, 1987 | Based on data from 377. to 574. K. See also Stull, 1947.; AC |
Antoine Equation Parameters
log10(P) = A − (B / (T + C))
P = vapor pressure (bar)
T = temperature (K)
View plot Requires a JavaScript / HTML 5 canvas capable browser.
Temperature (K) | A | B | C | Reference | Comment |
---|---|---|---|---|---|
377.5 to 573.9 | 5.00643 | 2685.958 | -36.72 | Stull, 1947 | Coefficents calculated by NIST from author's data. |
Enthalpy of fusion
ΔfusH (kJ/mol) | Temperature (K) | Reference | Comment |
---|---|---|---|
15.53 | 323.2 | Acree, 1991 | AC |

Gas phase ion energetics data

Data evaluated as indicated in comments:
HL - Edward P. Hunter and Sharon G. Lias
Data compiled as indicated in comments:
LBLHLM - Sharon G. Lias, John E. Bartmess, Joel F. Liebman, John L. Holmes, Rhoda D. Levin, and W. Gary Mallard
LLK - Sharon G. Lias, Rhoda D. Levin, and Sherif A. Kafafi
RDSH - Henry M. Rosenstock, Keith Draxl, Bruce W. Steiner, and John T. Herron
Quantity | Value | Units | Method | Reference | Comment |
---|---|---|---|---|---|
Proton affinity (review) | 907.0 | kJ/mol | N/A | Hunter and Lias, 1998 | HL |
Quantity | Value | Units | Method | Reference | Comment |
Gas basicity | 875.1 | kJ/mol | N/A | Hunter and Lias, 1998 | HL |
Ionization energy determinations
IE (eV) | Method | Reference | Comment |
---|---|---|---|
7.09 | PE | Klasinc, Kovac, et al., 1983 | LBLHLM |
7.3 ± 0.1 | CTS | Farrell and Newton, 1966 | RDSH |
7.39 | CTS | Kinoshita, 1962 | RDSH |
7.3 | PI | Terenin, 1961 | RDSH |
7.4 | CTS | Briegleb and Czekalla, 1959 | RDSH |
7.48 | PE | Klasinc, Kovac, et al., 1983 | Vertical value; LBLHLM |
7.46 | PE | Utsunomiya, Kobayashi, et al., 1975 | Vertical value; LLK |
Appearance energy determinations
Ion | AE (eV) | Other Products | Method | Reference | Comment |
---|---|---|---|---|---|
C9H7+ | 14.15 | HCN+H | EI | Occolowitz and White, 1968 | RDSH |
C9H8+ | 12.56 | HCN | EI | Occolowitz and White, 1968 | RDSH |

Van Den Dool and Kratz RI, non-polar column, temperature ramp

Data compiled by: NIST Mass Spectrometry Data Center, William E. Wallace, director

Column type CapillaryCapillary
Active phase OV-1DB-5
Column length (m)  30.
Carrier gas  He
Substrate
Column diameter (mm)  0.26
Phase thickness (μm)  0.25
Tstart (C) 35.50.
Tend (C) 300.300.
Heat rate (K/min) 8.6.
Initial hold (min)  4.
Final hold (min)  20.
I 1495.11550.
ReferenceGautzsch and Zinn, 1996Rostad and Pereira, 1986
Comment MSDC-RI MSDC-RI

Kovats' RI, non-polar column, isothermal

View large format table.

Column type Active phase Temperature (C) I Reference Comment
PackedSE-30180.1531.Oszczapowicz, Osek, et al., 1984N2, Chromosorb W AW; Column length: 3. m

Normal alkane RI, non-polar column, temperature ramp

View large format table.

Column type Active phase I Reference Comment
CapillarySE-301515.7Bur'yan and Nabivach, 19921.7 K/min; Tstart: 82. C; Tend: 177. C

Normal alkane RI, non-polar column, custom temperature program

View large format table.

Column type Active phase I Reference Comment
OtherMethyl Silicone1531.Ardrey and Moffat, 1981Program: not specified

Lee's RI, non-polar column, temperature ramp

View large format table.

Column type Active phase I Reference Comment
CapillaryDB-5MS262.17Chen, Keeran, et al., 200230. m/0.25 mm/0.5 μm, 40. C @ 1. min, 10. K/min; Tend: 310. C
CapillaryDB-5MS262.20Chen, Keeran, et al., 200230. m/0.25 mm/0.5 μm, 40. C @ 1. min, 4. K/min; Tend: 310. C
CapillarySE-52261.01Hasegawa, Usami, et al., 19902. K/min; Column length: 12. m; Column diameter: 0.25 mm; Tstart: 50. C; Tend: 270. C
CapillaryDB-5262.55Rostad and Pereira, 198630. m/0.26 mm/0.25 μm, He, 50. C @ 4. min, 6. K/min, 300. C @ 20. min
CapillarySE-52262.98Vassilaros, Kong, et al., 198220. m/0.30 mm/0.25 μm, H2, 40. C @ 2. min, 4. K/min; Tend: 265. C

References

Pushin, 1954
Pushin, N.A.,
Heats of combustion and heats of formation of isomeric organic compounds,
Bull. Soc. Chim. Belgrade, 1954, 19, 531-547. [all data]
Schmidt and Becker, 1933
Schmidt, V.A.; Becker, F.,
Die Bildungswarme von Nitrocellulofen, Nitroglycerin und anderen widuigen Beltandteilen von Treibmitteln,
Z. Gesamte Schiess Sprengstoffwes., 1933, 33, 280-282. [all data]
Lemoult, 1907
Lemoult, M.P.,
Recherches theoriques et experimentales sur les chaleurs de combustion et de formation des composes organiques,
Ann. Chim. Phys., 1907, 12, 395-432. [all data]
Balcan, Arzik, et al., 1996
Balcan, M.; Arzik, S.; Altunata, T.,
The determination of the heats of combustion and the resonance energies of some substituted naphthalenes,
Thermochim. Acta, 1996, 278, 49-56. [all data]
Milone and Rossignoli, 1932
Milone, M.; Rossignoli, P.,
Sul calore di combustione di alcune miscele di composti organici,
Gazz. Chim. Ital., 1932, 62, 644-655. [all data]
Cox and Pilcher, 1970
Cox, J.D.; Pilcher, G.,
Thermochemistry of Organic and Organometallic Compounds, Academic Press, New York, 1970, 1-636. [all data]
Weast and Grasselli, 1989
CRC Handbook of Data on Organic Compounds, 2nd Editon, Weast,R.C and Grasselli, J.G., ed(s)., CRC Press, Inc., Boca Raton, FL, 1989, 1. [all data]
Stillmann and Swain, 1899
Stillmann, J.M.; Swain, R.E.,
The melting heat of naphthylamine and diphenylamine in relation to their lowering of molecular freezing point,
Z. Phys. Chem., Stoechiom. Verwandtschaftsl., 1899, 29, 705. [all data]
Perkin, 1896
Perkin, W.H.,
LXIX. On Magnetic Rotatory Power, especially of Aromatic Compounds,
J. Chem. Soc., 1896, 69, 1025-1257. [all data]
Hofmann, 1844
Hofmann, A.W.,
A Chemical Investigation of the Organic Bases Contained in Coal Gas Naphtha,
Philos. Mag., 1844, 24, 115. [all data]
Verevkin, Georgieva, et al., 2007
Verevkin, Sergey P.; Georgieva, Miglena; Melkhanova, Svetlana V.,
Vapor Pressures and Phase Transitions of a Series of the Aminonaphthalenes,
J. Chem. Eng. Data, 2007, 52, 1, 286-290, https://doi.org/10.1021/je060394v
. [all data]
Stephenson and Malanowski, 1987
Stephenson, Richard M.; Malanowski, Stanislaw,
Handbook of the Thermodynamics of Organic Compounds, 1987, https://doi.org/10.1007/978-94-009-3173-2
. [all data]
Stull, 1947
Stull, Daniel R.,
Vapor Pressure of Pure Substances. Organic and Inorganic Compounds,
Ind. Eng. Chem., 1947, 39, 4, 517-540, https://doi.org/10.1021/ie50448a022
. [all data]
Acree, 1991
Acree, William E.,
Thermodynamic properties of organic compounds: enthalpy of fusion and melting point temperature compilation,
Thermochimica Acta, 1991, 189, 1, 37-56, https://doi.org/10.1016/0040-6031(91)87098-H
. [all data]
Hunter and Lias, 1998
Hunter, E.P.; Lias, S.G.,
Evaluated Gas Phase Basicities and Proton Affinities of Molecules: An Update,
J. Phys. Chem. Ref. Data, 1998, 27, 3, 413-656, https://doi.org/10.1063/1.556018
. [all data]
Klasinc, Kovac, et al., 1983
Klasinc, L.; Kovac, B.; Gusten, H.,
Photoelectron spectra of acenes. Electronic structure and substituent effects,
Pure Appl. Chem., 1983, 55, 289. [all data]
Farrell and Newton, 1966
Farrell, P.G.; Newton, J.,
Ionization potentials of primary aromatic amines and aza-hydrocarbons,
Tetrahedron Lett., 1966, 5517. [all data]
Kinoshita, 1962
Kinoshita, M.,
The absorption spectra of the molecular complexes of aromatic compounds with p-bromanil,
Bull. Chem. Soc. Japan, 1962, 35, 1609. [all data]
Terenin, 1961
Terenin, A.,
Charge transfer in organic solids, induced by light,
Proc. Chem. Soc., London, 1961, 321. [all data]
Briegleb and Czekalla, 1959
Briegleb, G.; Czekalla, J.,
Die Bestimmung von lonisierungsenergien aus den Spektren von Elektronenubergangskomplexen,
Z.Elektrochem., 1959, 63, 6. [all data]
Utsunomiya, Kobayashi, et al., 1975
Utsunomiya, C.; Kobayashi, T.; Nagakura, S.,
Photoelectron spectra of substituted naphthalenes,
Bull. Chem. Soc. Jpn., 1975, 48, 1852. [all data]
Occolowitz and White, 1968
Occolowitz, J.L.; White, G.L.,
Energetic considerations in the assignment of some fragment ion structures,
Australian J. Chem., 1968, 21, 997. [all data]