Phosphine, 1,2-propadienyl-
- Formula: C3H5P
- Molecular weight: 72.0456
- IUPAC Standard InChIKey: WWPYBNWNNHQNDJ-UHFFFAOYSA-N
- CAS Registry Number: 133672-87-4
- Chemical structure:
View 3d structure (requires JavaScript / HTML 5) - Permanent link for this species. Use this link for bookmarking this species for future reference.

Gas phase ion energetics data

Data compiled by: Sharon G. Lias and Joel F. Liebman
Ionization energy determinations
IE (eV) | Method | Reference | Comment |
---|---|---|---|
9.55 | PE | Lacombe, Dong, et al., 1992 | Vertical value |

References

Lacombe, Dong, et al., 1992
Lacombe, S.; Dong, W.; Pfister-Guillouzo, G.; Guillemin, J.C.; Denis, J.M.,
Gas-phase study and stability of alkynylphosphines and allenylphosphines: Photoelectronic study,
Inorg. Chem., 1992, 31, 4425. [all data]