Silane, trimethyl-2-propynyl-
- Formula: C6H12Si
- Molecular weight: 112.2450
- IUPAC Standard InChIKey: ULYLMHUHFUQKOE-UHFFFAOYSA-N
- CAS Registry Number: 13361-64-3
- Chemical structure:
View 3d structure (requires JavaScript / HTML 5) - Other names: 2-Propynyltrimethylsilane; Propyne, 3-trimethylsilyl; trimethyl-2-propynylsilane

Gas phase ion energetics data

Data compiled by: Henry M. Rosenstock, Keith Draxl, Bruce W. Steiner, and John T. Herron
Ionization energy determinations
IE (eV) | Method | Reference |
---|---|---|
9.04 ± 0.04 | EI | Bock and Seidl, 1968 |

Normal alkane RI, non-polar column, temperature ramp

Column type | Active phase | I | Reference | Comment |
---|---|---|---|---|
Capillary | OV-101 | 676. | Zenkevich, 2005 | 25. m/0.20 mm/0.10 μm, N2/He, 6. K/min; Tstart: 50. C; Tend: 250. C |

References

Bock and Seidl, 1968
Bock, H.; Seidl, H.,
d-Orbital effects in siliconsubstituted π-electron systems. Part XII. Some spectroscopic properties of alkyl and silyl acetylenes and polyacetylenes,
J. Chem. Soc. B, 1968, 1158. [all data]
Zenkevich, 2005
Zenkevich, I.G.,
Experimentally measured retention indices., 2005. [all data]