Stannane, tetrakis(2,2-dimethylpropyl)-
- Formula: C20H44Sn
- Molecular weight: 403.273
- IUPAC Standard InChIKey: JJUAYDMCJKHHMZ-UHFFFAOYSA-N
- CAS Registry Number: 13356-21-3
- Chemical structure:
View 3d structure (requires JavaScript / HTML 5) - Permanent link for this species. Use this link for bookmarking this species for future reference.

Gas phase ion energetics data

Data compiled by: Sharon G. Lias, Rhoda D. Levin, and Sherif A. Kafafi
Ionization energy determinations
IE (eV) | Method | Reference | Comment |
---|---|---|---|
8.67 | PE | Kochi, 1980 | Vertical value |
8.6 ± 0.1 | PE | Lappert, Pedley, et al., 1974 | Vertical value |

References

Kochi, 1980
Kochi, J.K.,
The role of electron transfer and charge transfer in organometallic chemistry,
Pure Appl. Chem., 1980, 52, 571. [all data]
Lappert, Pedley, et al., 1974
Lappert, M.F.; Pedley, J.B.; Sharp, G.,
Bonding studies of transition metal complexes. I. He(I) photoelectron spectra of d0 silylmethyl and neopentyl derivatives of Group IVA metals,
J. Organomet. Chem., 1974, 66, 271. [all data]