3-Phenylpropanal
- Formula: C9H10O
- Molecular weight: 134.1751
- IUPAC Standard InChIKey: YGCZTXZTJXYWCO-UHFFFAOYSA-N
- CAS Registry Number: 1335-10-0
- Chemical structure:
View 3d structure (requires JavaScript / HTML 5) - Species with the same structure:
- Other names: phenylpropionaldehyde

Gas phase ion energetics data

Data compiled as indicated in comments:
LBLHLM - Sharon G. Lias, John E. Bartmess, Joel F. Liebman, John L. Holmes, Rhoda D. Levin, and W. Gary Mallard
RDSH - Henry M. Rosenstock, Keith Draxl, Bruce W. Steiner, and John T. Herron
Ionization energy determinations
IE (eV) | Method | Reference | Comment |
---|---|---|---|
8.7 ± 0.2 | EI | Denhez and Audier, 1984 | LBLHLM |
9.1 ± 0.1 | EI | Occolowitz, 1967 | RDSH |

References

Denhez and Audier, 1984
Denhez, J.P.; Audier, H.E.,
Isomerization of [C6H5-C3H5O]+ Ions: The case of 1-phenylpropenol,
Org. Mass Spectrom., 1984, 19, 407. [all data]
Occolowitz, 1967
Occolowitz, J.L.,
Charge localization and the electronimpact fragmentation of carbonyl compounds,
Australian J. Chem., 1967, 20, 2387. [all data]