Silanediamine, 1,1-dichloro-N,N,N',N'-tetramethyl-

Gas phase ion energetics data

Data compiled by: Sharon G. Lias, Rhoda D. Levin, and Sherif A. Kafafi

Ionization energy determinations

IE (eV) Method Reference Comment
8.81PEGreen, Lappert, et al., 1971Vertical value

References

Green, Lappert, et al., 1971
Green, M.C.; Lappert, M.F.; Pedley, J.B.; Schmidt, W.; Wilkins, B.T., Photoelectron spectra energy level trends in MenSiCl4-n and related series, J. Organomet. Chem., 1971, 31, 55. [all data]