Silanamine, 1,1,1-trichloro-N,N-dimethyl-
- Formula: C2H6Cl3NSi
- Molecular weight: 178.520
- IUPAC Standard InChIKey: NEMUVWSQFWIZKP-UHFFFAOYSA-N
- CAS Registry Number: 13307-04-5
- Chemical structure:
View 3d structure (requires JavaScript / HTML 5) - Permanent link for this species. Use this link for bookmarking this species for future reference.

Gas phase ion energetics data

Data compiled by: Sharon G. Lias, Rhoda D. Levin, and Sherif A. Kafafi
Ionization energy determinations
IE (eV) | Method | Reference | Comment |
---|---|---|---|
9.30 | PE | Green, Lappert, et al., 1971 | Vertical value |

References

Green, Lappert, et al., 1971
Green, M.C.; Lappert, M.F.; Pedley, J.B.; Schmidt, W.; Wilkins, B.T.,
Photoelectron spectra energy level trends in MenSiCl4-n and related series,
J. Organomet. Chem., 1971, 31, 55. [all data]