tungsten hexachloride
- Formula: Cl6W
- Molecular weight: 396.56
- CAS Registry Number: 13283-01-7

Condensed phase thermochemistry data

Quantity | Value | Units | Method | Reference | Comment |
---|---|---|---|---|---|
ΔfH°liquid | -569.40 | kJ/mol | Review | Chase, 1998 | Data last reviewed in December, 1966 |
Quantity | Value | Units | Method | Reference | Comment |
S°liquid,1 bar | 284.87 | J/mol*K | Review | Chase, 1998 | Data last reviewed in December, 1966 |
Quantity | Value | Units | Method | Reference | Comment |
ΔfH°solid | -593.71 | kJ/mol | Review | Chase, 1998 | α phase; Data last reviewed in December, 1966 |
Liquid Phase Heat Capacity (Shomate Equation)
Cp° = A + B*t + C*t2 + D*t3 +
E/t2
H° − H°298.15= A*t + B*t2/2 +
C*t3/3 + D*t4/4 − E/t + F − H
S° = A*ln(t) + B*t + C*t2/2 + D*t3/3 −
E/(2*t2) + G
Cp = heat capacity (J/mol*K)
H° = standard enthalpy (kJ/mol)
S° = standard entropy (J/mol*K)
t = temperature (K) / 1000.
View plot Requires a JavaScript / HTML 5 canvas capable browser.
Temperature (K) | 555. to 1500. |
---|---|
A | 200.8324 |
B | 4.969755×10-8 |
C | -4.786413×10-8 |
D | 1.500823×10-8 |
E | 5.837016×10-10 |
F | -629.2820 |
G | 527.9078 |
H | -569.4047 |
Reference | Chase, 1998 |
Comment | Data last reviewed in December, 1966 |
Solid Phase Heat Capacity (Shomate Equation)
Cp° = A + B*t + C*t2 + D*t3 +
E/t2
H° − H°298.15= A*t + B*t2/2 +
C*t3/3 + D*t4/4 − E/t + F − H
S° = A*ln(t) + B*t + C*t2/2 + D*t3/3 −
E/(2*t2) + G
Cp = heat capacity (J/mol*K)
H° = standard enthalpy (kJ/mol)
S° = standard entropy (J/mol*K)
t = temperature (K) / 1000.
View plot Requires a JavaScript / HTML 5 canvas capable browser.
Temperature (K) | 298. to 450. | 450. to 555. | 298. to 555. |
---|---|---|---|
A | 125.5360 | 115.6050 | 188.2804 |
B | 167.2820 | 408.9070 | 4.267471×10-8 |
C | 0.138482 | -436.4930 | -4.151579×10-8 |
D | -0.084928 | 151.4520 | 1.312077×10-8 |
E | -0.000256 | -5.166790 | 4.868251×10-10 |
F | -638.5750 | -654.1360 | -629.0142 |
G | 340.5250 | 260.0600 | 508.4522 |
H | -593.7100 | -593.7100 | -572.8775 |
Reference | Chase, 1998 | Chase, 1998 | Chase, 1998 |
Comment | α phase; Data last reviewed in December, 1966 | α phase; Data last reviewed in December, 1966 | β phase; Data last reviewed in December, 1966 |

Gas phase ion energetics data

Data compiled by: Sharon G. Lias, Rhoda D. Levin, and Sherif A. Kafafi
Ionization energy determinations
IE (eV) | Method | Reference |
---|---|---|
9.5 | EI | Preiss, 1972 |
Appearance energy determinations
Ion | AE (eV) | Other Products | Method | Reference | Comment |
---|---|---|---|---|---|
ClW+ | 22.9 | ? | EI | Preiss, 1972 | |
Cl2W+ | 19.4 | ? | EI | Preiss, 1972 | |
Cl3W+ | 15.4 | ? | EI | Preiss, 1972 | |
Cl4W+ | 11.4 | ? | EI | Preiss, 1972 | |
Cl5W+ | 10.9 | ? | EI | Preiss, 1972 |

Gas phase thermochemistry data

Quantity | Value | Units | Method | Reference | Comment |
---|---|---|---|---|---|
ΔfH°gas | -493.71 | kJ/mol | Review | Chase, 1998 | Data last reviewed in December, 1966 |
Quantity | Value | Units | Method | Reference | Comment |
S°gas,1 bar | 419.14 | J/mol*K | Review | Chase, 1998 | Data last reviewed in December, 1966 |
Gas Phase Heat Capacity (Shomate Equation)
Cp° = A + B*t + C*t2 + D*t3 +
E/t2
H° − H°298.15= A*t + B*t2/2 +
C*t3/3 + D*t4/4 − E/t + F − H
S° = A*ln(t) + B*t + C*t2/2 + D*t3/3 −
E/(2*t2) + G
Cp = heat capacity (J/mol*K)
H° = standard enthalpy (kJ/mol)
S° = standard entropy (J/mol*K)
t = temperature (K) / 1000.
View plot Requires a JavaScript / HTML 5 canvas capable browser.
Temperature (K) | 1500. to 6000. |
---|---|
A | 157.2607 |
B | 0.610881 |
C | -0.165858 |
D | 0.014171 |
E | -1.210190 |
F | -544.6857 |
G | 602.4667 |
H | -493.7120 |
Reference | Chase, 1998 |
Comment | Data last reviewed in December, 1966 |

References

Chase, 1998
Chase, M.W., Jr.,
NIST-JANAF Themochemical Tables, Fourth Edition,
J. Phys. Chem. Ref. Data, Monograph 9, 1998, 1-1951. [all data]
Preiss, 1972
Preiss, H.,
Massenspektrometrische Untersuchungen an einigen Halogeniden der 5. Haupt- und Nebengruppe,
Z. Anorg. Allg. Chem., 1972, 389, 280. [all data]