Diethyl 2-furylsilane
- Formula: C8H14OSi
- Molecular weight: 154.2817
- IUPAC Standard InChIKey: OLJVBPWUDOIGRT-UHFFFAOYSA-N
- CAS Registry Number: 13271-67-5
- Chemical structure:
View 3d structure (requires JavaScript / HTML 5) - Permanent link for this species. Use this link for bookmarking this species for future reference.

Gas phase ion energetics data

Data compiled as indicated in comments:
LBLHLM - Sharon G. Lias, John E. Bartmess, Joel F. Liebman, John L. Holmes, Rhoda D. Levin, and W. Gary Mallard
Ionization energy determinations
IE (eV) | Method | Reference | Comment |
---|---|---|---|
8.1 | PE | Zykov, Erchak, et al., 1983 | LBLHLM |
8.62 | PE | Zykov, Erchak, et al., 1983 | Vertical value; LBLHLM |

References

Zykov, Erchak, et al., 1983
Zykov, B.G.; Erchak, N.P.; Khvostenko, V.I.; Lukevits, E.; Matorykina, V.F.; Asfandiarov, N.L.,
Photoelectron spectra of furylsilanes and their carbon analogs,
J. Organomet. Chem., 1983, 253, 301. [all data]