2-Cyclohexenone,3-bromo,5,5-dimethyl-
- Formula: C8H11BrO
- Molecular weight: 203.076
- IUPAC Standard InChIKey: LPZGJNIBSGPOED-UHFFFAOYSA-N
- CAS Registry Number: 13271-49-3
- Chemical structure:
View 3d structure (requires JavaScript / HTML 5) - Other names: 5,5-Dimethyl-3-bromocyclohex-2-enone; 3-Bromo-5,5-dimethyl-cyclohex-2-enone

Gas phase ion energetics data

Data compiled as indicated in comments:
LBLHLM - Sharon G. Lias, John E. Bartmess, Joel F. Liebman, John L. Holmes, Rhoda D. Levin, and W. Gary Mallard
Ionization energy determinations
IE (eV) | Method | Reference | Comment |
---|---|---|---|
9.35 | PE | Pfister-Guillouzo, Geribaldi, et al., 1982 | Vertical value; LBLHLM |

References

Pfister-Guillouzo, Geribaldi, et al., 1982
Pfister-Guillouzo, G.; Geribaldi, S.; Gal, J.-F.,
Spectres photoelectroniques de cyclohexene-2-ones-1 diversement substituees en position 3. Correlations avec la reactivite,
Can. J. Chem., 1982, 60, 1163. [all data]