Dibenzothiophene
- Formula: C12H8S
- Molecular weight: 184.257
- IUPAC Standard InChIKey: IYYZUPMFVPLQIF-UHFFFAOYSA-N
- CAS Registry Number: 132-65-0
- Chemical structure:
View 3d structure (requires JavaScript / HTML 5) - Other names: [1,1'-Biphenyl]-2,2'-diyl sulfide; Dibenzo[b,d]thiophene; Diphenylene sulfide; 2,2'-Biphenylylene sulfide; 9-Thiafluorene; α-Thiafluorene

Gas phase thermochemistry data

Data compiled as indicated in comments:
ALS - Hussein Y. Afeefy, Joel F. Liebman, and Stephen E. Stein
DRB - Donald R. Burgess, Jr.
Quantity | Value | Units | Method | Reference | Comment |
---|---|---|---|---|---|
ΔfH°gas | 51.0 ± 0.2 | kcal/mol | Cm | Chirico, Knipmeyer, et al., 1991 | ALS |
ΔfH°gas | 45.2 ± 1.1 | kcal/mol | Ccr | Sabbah and Antipine, 1987 | see Sabbah, 1979; ALS |
ΔfH°gas | 49.09 | kcal/mol | N/A | Good, 1972 | Value computed using ΔfHsolid° value of 120.3±1.5 kj/mol from Good, 1972 and ΔsubH° value of 85.1 kj/mol from Sabbah and Antipine, 1987.; DRB |

Condensed phase thermochemistry data

Data compiled as indicated in comments:
ALS - Hussein Y. Afeefy, Joel F. Liebman, and Stephen E. Stein
DH - Eugene S. Domalski and Elizabeth D. Hearing
Quantity | Value | Units | Method | Reference | Comment |
---|---|---|---|---|---|
ΔfH°solid | 24.9 ± 1.1 | kcal/mol | Ccr | Sabbah and Antipine, 1987 | see Sabbah, 1979; ALS |
ΔfH°solid | 28.76 ± 0.35 | kcal/mol | Ccr | Good, 1972 | ALS |
Quantity | Value | Units | Method | Reference | Comment |
ΔcH°solid | -1570.7 ± 1.1 | kcal/mol | Ccr | Sabbah and Antipine, 1987 | see Sabbah, 1979; ALS |
ΔcH°solid | -1574.49 ± 0.32 | kcal/mol | Ccr | Good, 1972 | ALS |
Quantity | Value | Units | Method | Reference | Comment |
S°solid,1 bar | 48.805 | cal/mol*K | N/A | Chirico, Knipmeyer, et al., 1991 | DH |
Constant pressure heat capacity of solid
Cp,solid (cal/mol*K) | Temperature (K) | Reference | Comment |
---|---|---|---|
47.395 | 298.15 | Chirico, Knipmeyer, et al., 1991 | T = 5 to 800 K.; DH |
46.51 | 298.15 | O'Rourke and Mraw, 1983 | T = 220 to 560 K. Cp = 0.6709 (T/K) - 5.4 (220 to 371.0 K) J/mol*K.; DH |

Phase change data

Data compiled as indicated in comments:
BS - Robert L. Brown and Stephen E. Stein
TRC - Thermodynamics Research Center, NIST Boulder Laboratories, Chris Muzny director
AC - William E. Acree, Jr., James S. Chickos
ALS - Hussein Y. Afeefy, Joel F. Liebman, and Stephen E. Stein
DRB - Donald R. Burgess, Jr.
DH - Eugene S. Domalski and Elizabeth D. Hearing
Quantity | Value | Units | Method | Reference | Comment |
---|---|---|---|---|---|
Tboil | 605.7 | K | N/A | Weast and Grasselli, 1989 | BS |
Quantity | Value | Units | Method | Reference | Comment |
Tfus | 372. ± 1. | K | AVG | N/A | Average of 7 values; Individual data points |
Quantity | Value | Units | Method | Reference | Comment |
Ttriple | 371.820 | K | N/A | Chirico, Knipmeyer, et al., 1991, 2 | Uncertainty assigned by TRC = 0.002 K; TRC |
Quantity | Value | Units | Method | Reference | Comment |
ΔvapH° | 18.7 ± 0.26 | kcal/mol | GC | Haftka, Parsons, et al., 2006 | Based on data from 413. to 473. K.; AC |
Quantity | Value | Units | Method | Reference | Comment |
ΔsubH° | 21. ± 2. | kcal/mol | AVG | N/A | Average of 6 values; Individual data points |
Reduced pressure boiling point
Tboil (K) | Pressure (atm) | Reference | Comment |
---|---|---|---|
426.2 | 0.004 | Weast and Grasselli, 1989 | BS |
Enthalpy of vaporization
ΔvapH (kcal/mol) | Temperature (K) | Method | Reference | Comment |
---|---|---|---|---|
15.7 | 388. | N/A | Dykyj, Svoboda, et al., 1999 | Based on data from 373. to 424. K.; AC |
15.2 | 439. | N/A | Dykyj, Svoboda, et al., 1999 | Based on data from 424. to 608. K.; AC |
16.6 ± 0.07 | 380. | N/A | Steele, Chirico, et al., 1995 | AC |
16.0 ± 0.07 | 420. | N/A | Steele, Chirico, et al., 1995 | AC |
15.4 ± 0.07 | 460. | N/A | Steele, Chirico, et al., 1995 | AC |
14.8 ± 0.07 | 500. | N/A | Steele, Chirico, et al., 1995 | AC |
14.2 ± 0.07 | 540. | N/A | Steele, Chirico, et al., 1995 | AC |
13.6 ± 0.07 | 580. | N/A | Steele, Chirico, et al., 1995 | AC |
12.9 ± 0.07 | 620. | N/A | Steele, Chirico, et al., 1995 | AC |
16.3 ± 0.02 | 400. | EB,IP | Chirico, Knipmeyer, et al., 1991 | Based on data from 375. to 662. K.; AC |
15.5 ± 0.02 | 450. | EB,IP | Chirico, Knipmeyer, et al., 1991 | Based on data from 375. to 662. K.; AC |
14.8 ± 0.02 | 500. | EB,IP | Chirico, Knipmeyer, et al., 1991 | Based on data from 375. to 662. K.; AC |
14.0 ± 0.02 | 550. | EB,IP | Chirico, Knipmeyer, et al., 1991 | Based on data from 375. to 662. K.; AC |
13.2 ± 0.07 | 600. | EB,IP | Chirico, Knipmeyer, et al., 1991 | Based on data from 375. to 662. K.; AC |
12.4 ± 0.1 | 650. | EB,IP | Chirico, Knipmeyer, et al., 1991 | Based on data from 375. to 662. K.; AC |
14.4 | 400. | A | Stephenson and Malanowski, 1987 | Based on data from 385. to 574. K.; AC |
13.6 | 590. | C | Mraw and Keweshan, 1984 | AC |
13.2 | 610. | C | Mraw and Keweshan, 1984 | AC |
12.8 | 630. | C | Mraw and Keweshan, 1984 | AC |
16.6 | 385. | GS | Edwards and Prausnitz, 1981 | Based on data from 373. to 403. K.; AC |
Enthalpy of sublimation
ΔsubH (kcal/mol) | Temperature (K) | Method | Reference | Comment |
---|---|---|---|---|
21.8 | 325. | T | Hansen and Eckert, 1986 | Based on data from 303. to 348. K.; AC |
21.7 | 348. | GS | Edwards and Prausnitz, 1981 | Based on data from 333. to 363. K.; AC |
Enthalpy of fusion
ΔfusH (kcal/mol) | Temperature (K) | Method | Reference | Comment |
---|---|---|---|---|
5.1883 | 371.821 | N/A | Chirico, Knipmeyer, et al., 1991 | DH |
5.1577 | 371.0 | N/A | O'Rourke and Mraw, 1983 | DH |
5.16 | 371.8 | DSC | Lisicki and Jamróz, 2000 | AC |
5.158 | 371. | N/A | Domalski and Hearing, 1996 | AC |
5.16 | 373.2 | N/A | O'Rourke and Mraw, 1983 | AC |
Entropy of fusion
ΔfusS (cal/mol*K) | Temperature (K) | Reference | Comment |
---|---|---|---|
13.95 | 371.821 | Chirico, Knipmeyer, et al., 1991 | DH |
13.90 | 371.0 | O'Rourke and Mraw, 1983 | DH |

Gas phase ion energetics data

Data compiled as indicated in comments:
LLK - Sharon G. Lias, Rhoda D. Levin, and Sherif A. Kafafi
RDSH - Henry M. Rosenstock, Keith Draxl, Bruce W. Steiner, and John T. Herron
Ionization energy determinations
IE (eV) | Method | Reference | Comment |
---|---|---|---|
8.44 | EI | Terlouw, Heerma, et al., 1974 | LLK |
8.34 | EI | Aloisi and Pignataro, 1973 | LLK |
8.23 | CTS | Aloisi and Pignataro, 1973 | LLK |
7.90 ± 0.03 | PI | Potapov, Kardash, et al., 1972 | LLK |
8.14 | CTS | Mukherjee, 1969 | RDSH |
7.93 | PE | Ruscic, Kovac, et al., 1978 | Vertical value; LLK |
8.01 | PE | Johnstone and Mellon, 1973 | Vertical value; LLK |

Lee's RI, non-polar column, temperature ramp

Data compiled by: NIST Mass Spectrometry Data Center, William E. Wallace, director

Column type CapillaryCapillaryCapillaryCapillaryCapillary
Active phase Rxi-5 MSDB-5MSHP-5HP-5HP-5
Column length (m) 30.30.30.60.60.
Carrier gas Helium HeliumHeHe
Substrate
Column diameter (mm) 0.250.250.250.250.25
Phase thickness (μm) 0.250.250.250.250.25
Tstart (C) 60.50.50.35.35.
Tend (C) 340.300.310.300.300.
Heat rate (K/min) 5.6.6.3.3.
Initial hold (min) 1.2.1.5
Final hold (min) 0.16.10.
I 295.47295.99296.06295.59295.59
ReferenceZeigler, Schantz, et al., 2012Sun, Zhou, et al., 2008Pedersen, Durant, et al., 2005Marynowski, Pieta, et al., 2004Marynowski, Pieta, et al., 2004
Comment MSDC-RI MSDC-RI MSDC-RI MSDC-RI MSDC-RI
Column type CapillaryCapillaryCapillaryCapillaryCapillary
Active phase HP-5MSDB-5MSDB-5DB-5DB-5
Column length (m) 30.30.30.30.25.
Carrier gas     He
Substrate
Column diameter (mm) 0.250.250.250.250.3
Phase thickness (μm) 0.250.50.250.25
Tstart (C) 65.40.50.50.60.
Tend (C) 290.310.300.300.270.
Heat rate (K/min) 3.10.15.15.5.
Initial hold (min) 5.1.  2.
Final hold (min) 20.
I 295.73295.85295.6295.6296.01
ReferenceZhou, Wang, et al., 2004Chen, Keeran, et al., 2002Durlak, Biswas, et al., 1998Durlak, Biswas, et al., 1998Williams and Bottrill, 1995
Comment MSDC-RI MSDC-RI MSDC-RI MSDC-RI MSDC-RI
Column type CapillaryCapillaryCapillaryCapillaryCapillary
Active phase PB-1DB-5DB-5SPB-5CP Sil 8 CB
Column length (m) 50.30.30.30.50.
Carrier gas H2H2He He
Substrate
Column diameter (mm) 0.320.320.320.250.25
Phase thickness (μm) 0.20.250.25 0.25
Tstart (C) 80.80.50.40.80.
Tend (C) 270.270.300.300.300.
Heat rate (K/min) 4.4.6.4.4.
Initial hold (min) 2.2.2.2.
Final hold (min) 5.5.
I 295.77295.78295.96296.3295.9
ReferenceAndersson and Weis, 1994Andersson and Weis, 1994Wang, Fingas, et al., 1994Knobloch and Engewald, 1993Bundt, Herbel, et al., 1991
Comment MSDC-RI MSDC-RI MSDC-RI MSDC-RI MSDC-RI
Column type CapillaryCapillaryCapillaryCapillaryCapillary
Active phase OV-101DB-5DB-5OV-73DB-5
Column length (m) 25.30.30.68.30.
Carrier gas H2   He
Substrate
Column diameter (mm) 0.220.320.250.280.26
Phase thickness (μm)   0.250.150.25
Tstart (C) 50.80.40. 50.
Tend (C) 300.300.280. 300.
Heat rate (K/min) 4.3.54.1.56.
Initial hold (min)  1.2. 4.
Final hold (min)  10.5. 20.
I 295.95295.4295.59295.9296.03
ReferenceBlanco, Blanco, et al., 1989Palmentier, Britten, et al., 1989Wise, Benner, et al., 1988Arpino, Ignatiadis, et al., 1987Rostad and Pereira, 1986
Comment MSDC-RI MSDC-RI MSDC-RI MSDC-RI MSDC-RI
Column type CapillaryCapillaryCapillaryCapillaryCapillary
Active phase DB-5DB-5SE-52SE-52SE-52
Column length (m) 30.30.19.620.20.
Carrier gas HeHeH2H2H2
Substrate
Column diameter (mm) 0.250.320.320.300.30
Phase thickness (μm)    0.250.25
Tstart (C) 90.80.40.40.40.
Tend (C) 325.300.280.265.265.
Heat rate (K/min) 4.3.8.4.4.
Initial hold (min)  1. 2.2.
Final hold (min)  10.
I 294.74295.312296.00295.39296.01
ReferenceTong, Centen, et al., 1985Tong, Shore, et al., 1984Kong, Lee, et al., 1982Vassilaros, Kong, et al., 1982Vassilaros, Kong, et al., 1982
Comment MSDC-RI MSDC-RI MSDC-RI MSDC-RI MSDC-RI
Column type Capillary
Active phase SE-52
Column length (m) 12.
Carrier gas He
Substrate
Column diameter (mm) 0.3
Phase thickness (μm) 0.34
Tstart (C) 50.
Tend (C) 250.
Heat rate (K/min) 2.
Initial hold (min)
Final hold (min)
I 295.81
ReferenceLee, Vassilaros, et al., 1979
Comment MSDC-RI

Lee's RI, non-polar column, custom temperature program

Data compiled by: NIST Mass Spectrometry Data Center, William E. Wallace, director

Column type CapillaryCapillaryCapillaryCapillaryCapillary
Active phase DB-5HP-5MSHP-5MSHP-5MSHP-5MS
Column length (m) 60.30.30.30.30.
Carrier gas  HeHeHe
Substrate
Column diameter (mm)  0.250.250.250.25
Phase thickness (μm)  0.250.250.250.25
Program not specified60C(2min) => 6C/min => 258C => 2C/min => 300C(4min)not specifiednot specifiednot specified
I 296.295.95295.59295.95295.70
ReferenceFuentes, Font, et al., 2007Wang, Li, et al., 2007Wang, Li, et al., 2007, 2Wang, Li, et al., 2007, 2Zhou, Wang, et al., 2004
Comment MSDC-RI MSDC-RI MSDC-RI MSDC-RI MSDC-RI
Column type CapillaryCapillaryCapillaryCapillaryCapillary
Active phase DB-5SPB-5DB-5HP-5DB-5
Column length (m) 30.60.60.50.30.
Carrier gas  HeHeHeHe
Substrate
Column diameter (mm) 0.250.320.250.320.25
Phase thickness (μm) 0.250.100.250.50.25
Program not specifiedA: 105 0C (2 min) 2.5 0C -> 230 0C 50 0C/min -> 305 0C (15 min) B: 95 0C (2 min) 3.8 0C/min -> 310 0C (5 min)60C (1 min) => 45 C/min => 150C (2 min) => 2 C/min => 300 C (25 min)35C => 25C/min => 160C => 3C/min => 300C(50min)90C (1min) => 10C/min => 120C => 4C/min => 310C (20min)
I 295.7294.65293.59295.7295.28
ReferenceLundstedt, Haglund, et al., 2003Thuss, Popp, et al., 2000Mössner, de Alda, et al., 1999Becker, Nilsson, et al., 1998Zamperlini, Silva, et al., 1997
Comment MSDC-RI MSDC-RI MSDC-RI MSDC-RI MSDC-RI
Column type CapillaryCapillaryCapillaryCapillaryCapillary
Active phase SE-54DB-5CP Sil 8 CBCP Sil 8 CBSE-54
Column length (m)  30.50.50.15.
Carrier gas  HeHeHeHe
Substrate
Column diameter (mm)  0.250.250.250.25
Phase thickness (μm)  0.250.250.250.25
Program not specified60 0C (3 min) 10 0C/min -> 100 0C (3 min) 5 0C/min -> 300 0Cnot specifiednot specified125 0C (15 min) 1 0C/min -> 131 0C 4 0C/min -> 247 0C 8 0C/min -> 280 0C (15 min)
I 295.24295.2295.8295.9295.9
ReferenceGuillen, Iglesias, et al., 1992Paschke, Herbel, et al., 1992Bundt, Herbel, et al., 1991Bundt, Herbel, et al., 1991Peterman and Delfino, 1990
Comment MSDC-RI MSDC-RI MSDC-RI MSDC-RI MSDC-RI
Column type CapillaryCapillaryCapillary
Active phase DB-5OV-101DB-5
Column length (m)   30.
Carrier gas He He
Substrate
Column diameter (mm)   0.25
Phase thickness (μm)
Program 70C(2min) => 30C/min => 150C => 5C/min => 200C => 4C/min => 310Cnot specifiednot specified
I 294.9295.9295.81
ReferenceTakada, Onda, et al., 1990Tucminen, Wickstrom, et al., 1986Tong, Centen, et al., 1985
Comment MSDC-RI MSDC-RI MSDC-RI

Kovats' RI, non-polar column, isothermal

Data compiled by: NIST Mass Spectrometry Data Center, William E. Wallace, director

Column type CapillaryCapillary
Active phase OV-1OV-101
Column length (m) 25.50.
Carrier gas N2N2
Substrate
Column diameter (mm) 0.20.3
Phase thickness (μm) 0.33
Temperature (C) 160.180.
I 1717.1739.8
ReferenceZhang, Chen, et al., 1997Gerasimenko, Kirilenko, et al., 1981
Comment MSDC-RI Large deviations from similar measurements; Measurement made at atypical conditions; MSDC-RI

References

Chirico, Knipmeyer, et al., 1991
Chirico, R.D.; Knipmeyer, S.E.; Nguyen, A.; Steele, W.V.,
The thermodynamic properties of dibenzothiophene,
J. Chem. Thermodyn., 1991, 23, 431-450. [all data]
Sabbah and Antipine, 1987
Sabbah, R.; Antipine, I.,
Thermodynamic study on four polycycles. Relationship between their energy values and their structure,
Bull. Soc. Chim. Fr., 1987, 392-400. [all data]
Sabbah, 1979
Sabbah, R.,
Thermodynamique de substances soufrees. I. Etude thermochimique du benzo-2,3 thiophene et du dibenzothiophene,
Bull. Soc. Chim. France, 1979, 9, 434-437. [all data]
Good, 1972
Good, W.D.,
Enthalpies of combustion of 18 organic sulfur compounds related to petroleum,
J. Chem. Eng. Data, 1972, 17, 158-162. [all data]
O'Rourke and Mraw, 1983
O'Rourke, D.F.; Mraw, S.C.,
Heat capacities and enthalpies of fusion of dibenzothiophene (220 to 560 K) and of biphenyl, cyclohexylbenzene, and cyclohexylcyclohexane (220 to 475 K). Enthalpies and temperatures of three transitions in solid cyclohexylcyclohexane,
J. Chem. Thermodynam., 1983, 15, 489-502. [all data]
Weast and Grasselli, 1989
CRC Handbook of Data on Organic Compounds, 2nd Editon, Weast,R.C and Grasselli, J.G., ed(s)., CRC Press, Inc., Boca Raton, FL, 1989, 1. [all data]
Chirico, Knipmeyer, et al., 1991, 2
Chirico, R.D.; Knipmeyer, S.E.; Nguyen, A.; Steele, W.V.,
The thermodynamic properties of dibenzothiophene,
J. Chem. Thermodyn., 1991, 23, 431-50. [all data]
Haftka, Parsons, et al., 2006
Haftka, Joris J.H.; Parsons, John R.; Govers, Harrie A.J.,
Supercooled liquid vapour pressures and related thermodynamic properties of polycyclic aromatic hydrocarbons determined by gas chromatography,
Journal of Chromatography A, 2006, 1135, 1, 91-100, https://doi.org/10.1016/j.chroma.2006.09.050
. [all data]
Dykyj, Svoboda, et al., 1999
Dykyj, J.; Svoboda, J.; Wilhoit, R.C.; Frenkel, M.L.; Hall, K.R.,
Vapor Pressure of Chemicals: Part A. Vapor Pressure and Antoine Constants for Hydrocarbons and Sulfur, Selenium, Tellurium and Hydrogen Containing Organic Compounds, Springer, Berlin, 1999, 373. [all data]
Steele, Chirico, et al., 1995
Steele, W.V.; Chirico, R.D.; Cowell, A.B.; Nguyen, A.; Knipmeyer, S.E.,
Possible precursors and products of deep hydrodesulfurization of distillate fuels,
The Journal of Chemical Thermodynamics, 1995, 27, 12, 1407-1428, https://doi.org/10.1006/jcht.1995.0149
. [all data]
Stephenson and Malanowski, 1987
Stephenson, Richard M.; Malanowski, Stanislaw,
Handbook of the Thermodynamics of Organic Compounds, 1987, https://doi.org/10.1007/978-94-009-3173-2
. [all data]
Mraw and Keweshan, 1984
Mraw, Stephen C.; Keweshan, Charles F.,
Calvet-type calorimeter for the study of high-temperature processes II. New ballistic method for the enthalpy of vaporization of organic materials at high temperatures,
The Journal of Chemical Thermodynamics, 1984, 16, 9, 873-883, https://doi.org/10.1016/0021-9614(84)90035-1
. [all data]
Edwards and Prausnitz, 1981
Edwards, D.R.; Prausnitz, J.M.,
Vapor pressures of some sulfur-containing, coal-related compounds,
J. Chem. Eng. Data, 1981, 26, 2, 121-124, https://doi.org/10.1021/je00024a005
. [all data]
Hansen and Eckert, 1986
Hansen, Philip C.; Eckert, Charles A.,
An improved transpiration method for the measurement of very low vapor pressures,
J. Chem. Eng. Data, 1986, 31, 1, 1-3, https://doi.org/10.1021/je00043a001
. [all data]
Lisicki and Jamróz, 2000
Lisicki, Zygmunt; Jamróz, Malgorzata E.,
(Solid + liquid) equilibria in (polynuclear aromatic+ tertiary amide) systems,
The Journal of Chemical Thermodynamics, 2000, 32, 10, 1335-1353, https://doi.org/10.1006/jcht.2000.0685
. [all data]
Domalski and Hearing, 1996
Domalski, Eugene S.; Hearing, Elizabeth D.,
Heat Capacities and Entropies of Organic Compounds in the Condensed Phase. Volume III,
J. Phys. Chem. Ref. Data, 1996, 25, 1, 1, https://doi.org/10.1063/1.555985
. [all data]
Terlouw, Heerma, et al., 1974
Terlouw, J.K.; Heerma, W.; Frintrop, P.C.M.; Dijkstra, G.; Meinema, H.A.,
Electron-impact induced fragmentation of some heterocyclic-tin compounds,
J. Organomet. Chem., 1974, 64, 205. [all data]
Aloisi and Pignataro, 1973
Aloisi, G.G.; Pignataro, S.,
Molecular complexes of substituted thiophens with σ and π acceptors,
J. Chem. Soc. Faraday Trans. 1, 1973, 69, 534. [all data]
Potapov, Kardash, et al., 1972
Potapov, V.K.; Kardash, I.E.; Sorokin, V.V.; Sokolov, S.A.; Evlasheva, T.I.,
Photoionization of heteroaromatic compounds,
Khim. Vys. Energ., 1972, 6, 392. [all data]
Mukherjee, 1969
Mukherjee, T.K.,
Charge-transfer donor abilities of o,o'bridged biphenyls,
J. Phys. Chem., 1969, 73, 3442. [all data]
Ruscic, Kovac, et al., 1978
Ruscic, B.; Kovac, B.; Klasinc, L.; Gusten, H.,
Photoelectron spectroscopy of J. Heterocycl. Chem.. Fluorene analogues,
Z. Naturforsch. A:, 1978, 33, 1006. [all data]
Johnstone and Mellon, 1973
Johnstone, R.A.W.; Mellon, F.A.,
Photoelectron spectroscopy of sulphur-containing heteroaromatics and molecular orbital calculations,
J. Chem. Soc. Faraday Trans. 2, 1973, 69, 1155. [all data]