Dibenzofuran
- Formula: C12H8O
- Molecular weight: 168.1913
- IUPAC Standard InChIKey: TXCDCPKCNAJMEE-UHFFFAOYSA-N
- CAS Registry Number: 132-64-9
- Chemical structure:
View 3d structure (requires JavaScript / HTML 5) - Other names: [1,1'-Biphenyl]-2,2'-diyl oxide; Dibenzo[b,d]furan; Diphenylene oxide; 2,2'-Biphenylene oxide; 2,2'-Biphenylylene oxide; Dibenzofurane

Gas phase thermochemistry data

Data compiled as indicated in comments:
ALS - Hussein Y. Afeefy, Joel F. Liebman, and Stephen E. Stein
GT - Glushko Thermocenter, Russian Academy of Sciences, Moscow
Quantity | Value | Units | Method | Reference | Comment |
---|---|---|---|---|---|
ΔfH°gas | 11.3 ± 1.1 | kcal/mol | Ccb | Sabbah, 1991 | see Sabbah and Antipine, 1987 and Chirico, Gammon, et al., 1990; ALS |
Constant pressure heat capacity of gas
Cp,gas (cal/mol*K) | Temperature (K) | Reference | Comment |
---|---|---|---|
25.019 | 200. | Klots T.D., 1996 | GT |
32.015 | 250. | ||
38.970 | 298.15 | ||
39.247 | 300. | ||
46.243 | 350. | ||
52.780 | 400. | ||
58.702 | 450. | ||
64.008 | 500. | ||
68.719 | 550. | ||
72.930 | 600. | ||
78.714 | 650. | ||
80.005 | 700. |

Condensed phase thermochemistry data

Data compiled as indicated in comments:
ALS - Hussein Y. Afeefy, Joel F. Liebman, and Stephen E. Stein
DH - Eugene S. Domalski and Elizabeth D. Hearing
Quantity | Value | Units | Method | Reference | Comment |
---|---|---|---|---|---|
ΔfH°solid | -7.0 ± 1.1 | kcal/mol | Ccb | Sabbah, 1991 | see Sabbah and Antipine, 1987 and Chirico, Gammon, et al., 1990; ALS |
Quantity | Value | Units | Method | Reference | Comment |
ΔcH°solid | -1394.9 ± 1.1 | kcal/mol | Ccb | Sabbah, 1991 | see Sabbah and Antipine, 1987 and Chirico, Gammon, et al., 1990; Corresponding ΔfHºsolid = -6.96 kcal/mol (simple calculation by NIST; no Washburn corrections); ALS |
ΔcH°solid | -1400.5 ± 1.0 | kcal/mol | Ccb | Cass, Fletcher, et al., 1958 | Corresponding ΔfHºsolid = -1.4 kcal/mol (simple calculation by NIST; no Washburn corrections); ALS |
Quantity | Value | Units | Method | Reference | Comment |
S°solid,1 bar | 46.888 | cal/mol*K | N/A | Chirico, Gammon, et al., 1990 | crystaline, I phase; S (298.15 K, liq) = 244.97 J/mol*K.; DH |
Constant pressure heat capacity of solid
Cp,solid (cal/mol*K) | Temperature (K) | Reference | Comment |
---|---|---|---|
47.565 | 298.15 | Chirico, Gammon, et al., 1990 | crystaline, I phase; T = 5 to 720 K. Data graphically extrapolated. Cp (298.15 K, liq) = 237.57 J/mol*K, graphically extrapolated.; DH |

Phase change data

Data compiled as indicated in comments:
BS - Robert L. Brown and Stephen E. Stein
TRC - Thermodynamics Research Center, NIST Boulder Laboratories, Chris Muzny director
DH - Eugene S. Domalski and Elizabeth D. Hearing
AC - William E. Acree, Jr., James S. Chickos
ALS - Hussein Y. Afeefy, Joel F. Liebman, and Stephen E. Stein
DRB - Donald R. Burgess, Jr.
Quantity | Value | Units | Method | Reference | Comment |
---|---|---|---|---|---|
Tboil | 558.2 | K | N/A | Aldrich Chemical Company Inc., 1990 | BS |
Tboil | 560.2 | K | N/A | Weast and Grasselli, 1989 | BS |
Tboil | 560.15 | K | N/A | Cooper, Crowne, et al., 1967 | Uncertainty assigned by TRC = 0.6 K; TRC |
Quantity | Value | Units | Method | Reference | Comment |
Tfus | 355. ± 3. | K | AVG | N/A | Average of 6 values; Individual data points |
Quantity | Value | Units | Method | Reference | Comment |
Ttriple | 355.31 | K | N/A | Chirico, Gammon, et al., 1990, 2 | Crystal phase 1 phase; Uncertainty assigned by TRC = 0.02 K; TRC |
Quantity | Value | Units | Method | Reference | Comment |
Tc | 824. | K | N/A | Chirico, Gammon, et al., 1990, 2 | Uncertainty assigned by TRC = 4. K; TRC |
Quantity | Value | Units | Method | Reference | Comment |
Pc | 35.92 | atm | N/A | Chirico, Gammon, et al., 1990, 2 | Uncertainty assigned by TRC = 0.987 atm; TRC |
Quantity | Value | Units | Method | Reference | Comment |
ρc | 2.02 | mol/l | N/A | Chirico, Gammon, et al., 1990, 2 | Uncertainty assigned by TRC = 0.03 mol/l; TRC |
Quantity | Value | Units | Method | Reference | Comment |
ΔsubH° | 19. ± 2. | kcal/mol | AVG | N/A | Average of 6 values; Individual data points |
Enthalpy of vaporization
ΔvapH (kcal/mol) | Temperature (K) | Method | Reference | Comment |
---|---|---|---|---|
15.8 | 398. | GC | Lei, Chankalal, et al., 2002 | Based on data from 323. to 473. K.; AC |
13.2 | 418. | A | Stephenson and Malanowski, 1987 | Based on data from 403. to 559. K.; AC |
15.8 | 410. | N/A | Cass, Fletcher, et al., 1958, 2 | Based on data from 403. to 418. K.; AC |
Enthalpy of sublimation
ΔsubH (kcal/mol) | Temperature (K) | Method | Reference | Comment |
---|---|---|---|---|
19.6 ± 0.36 | 307. | ME | Li, Shibata, et al., 2004 | Based on data from 295. to 318. K.; AC |
20.5 | 324. | T | Rordorf, 1989 | Based on data from 304. to 343. K. See also Rordorf, 1986.; AC |
18.9 | 323. | N/A | Hansen and Eckert, 1986 | Based on data from 303. to 343. K.; AC |
18.3 | 323. | GS | SATO, INOMATA, et al., 1986 | Based on data from 299. to 346. K.; AC |
Enthalpy of fusion
ΔfusH (kcal/mol) | Temperature (K) | Method | Reference | Comment |
---|---|---|---|---|
4.45 | 354.7 | DSC | Kestens, Auclair, et al., 2010 | AC |
4.639 | 355.1 | N/A | Hafsaoui and Mahmoud, 2007 | AC |
4.90 | 355.8 | DSC | Lisicki and Jamróz, 2000 | AC |
4.21 | 355.2 | DSC | Mahmoud, Solimando, et al., 2000 | AC |
4.45 | 355.7 | N/A | Chirico, Gammon, et al., 1990 | AC |
Enthalpy of phase transition
ΔHtrs (kcal/mol) | Temperature (K) | Initial Phase | Final Phase | Reference | Comment |
---|---|---|---|---|---|
0.00 | 292.5 | crystaline, II | crystaline, I | Chirico, Gammon, et al., 1990 | DH |
4.611294 | 355.31 | crystaline, I | liquid | Chirico, Gammon, et al., 1990 | DH |
Entropy of phase transition
ΔStrs (cal/mol*K) | Temperature (K) | Initial Phase | Final Phase | Reference | Comment |
---|---|---|---|---|---|
12.98 | 355.31 | crystaline, I | liquid | Chirico, Gammon, et al., 1990 | DH |

Gas phase ion energetics data

Data compiled as indicated in comments:
LLK - Sharon G. Lias, Rhoda D. Levin, and Sherif A. Kafafi
RDSH - Henry M. Rosenstock, Keith Draxl, Bruce W. Steiner, and John T. Herron
Ionization energy determinations
IE (eV) | Method | Reference | Comment |
---|---|---|---|
8.77 | EI | Terlouw, Heerma, et al., 1974 | LLK |
8.22 | PE | Dewar, Harget, et al., 1970 | RDSH |
7.9 ± 0.05 | PE | Eland, 1969 | RDSH |
8.09 | PE | Ruscic, Kovac, et al., 1978 | Vertical value; LLK |

Lee's RI, non-polar column, custom temperature program

Data compiled by: NIST Mass Spectrometry Data Center, William E. Wallace, director

Column type CapillaryCapillaryCapillaryCapillaryCapillary
Active phase DB-5HP-5MSHP-5MSHP-5MSHP-5MS
Column length (m) 60.30.30.30.30.
Carrier gas  HeHeHe
Substrate
Column diameter (mm)  0.250.250.250.25
Phase thickness (μm)  0.250.250.250.25
Program not specified60C(2min) => 6C/min => 258C => 2C/min => 300C(4min)not specifiednot specifiednot specified
I 260.8259.63259.07259.63251.74
ReferenceFuentes, Font, et al., 2007Wang, Li, et al., 2007Wang, Li, et al., 2007, 2Wang, Li, et al., 2007, 2Zhou, Wang, et al., 2004
Comment MSDC-RI MSDC-RI MSDC-RI MSDC-RI MSDC-RI
Column type CapillaryCapillaryCapillaryCapillaryCapillary
Active phase DB-5LM-5SE-52SE-54DB-5
Column length (m) 30.30.30. 30.
Carrier gas  He  He
Substrate
Column diameter (mm) 0.250.250.30 0.25
Phase thickness (μm) 0.250.25  0.25
Program not specified60C(2min) => 15C/min => 180C => 5C/min => 280C(5min)not specifiednot specified60 0C (3 min) 10 0C/min -> 100 0C (3 min) 5 0C/min -> 300 0C
I 258.7259.74263.31258.53261.3
ReferenceLundstedt, Haglund, et al., 2003Ré-Poppi and Santiago-Silva, 2002Wang, Peng, et al., 1997Guillen, Iglesias, et al., 1992Paschke, Herbel, et al., 1992
Comment MSDC-RI MSDC-RI MSDC-RI MSDC-RI MSDC-RI
Column type CapillaryCapillaryCapillaryCapillaryCapillary
Active phase CP Sil 8 CBCP Sil 8 CBDB-5DB-5OV-101
Column length (m) 50.50.30.30.
Carrier gas HeHe
Substrate
Column diameter (mm) 0.250.250.320.32
Phase thickness (μm) 0.250.25
Program not specifiednot specifiednot specifiednot specifiednot specified
I 258.8259.1256.05257.17259.8
ReferenceBundt, Herbel, et al., 1991Bundt, Herbel, et al., 1991Naikwadi, Charbonneau, et al., 1987Naikwadi, Charbonneau, et al., 1987Tucminen, Wickstrom, et al., 1986
Comment MSDC-RI MSDC-RI MSDC-RI MSDC-RI MSDC-RI

Kovats' RI, non-polar column, isothermal

View large format table.

Column type Active phase Temperature (C) I Reference Comment
CapillaryOV-1150.1504.Zhang, Chen, et al., 199725. m/0.2 mm/0.33 μm, N2
CapillaryOV-1150.1504.Zhang, Chen, et al., 199725. m/0.2 mm/0.33 μm, N2
CapillaryOV-1150.1504.Zhang, Chen, et al., 199725. m/0.2 mm/0.33 μm, N2
CapillaryOV-1160.1514.Zhang, Chen, et al., 199725. m/0.2 mm/0.33 μm, N2
CapillaryOV-101140.1494.9Gerasimenko, Kirilenko, et al., 1981N2; Column length: 50. m; Column diameter: 0.3 mm

Kovats' RI, polar column, isothermal

View large format table.

Column type Active phase Temperature (C) I Reference Comment
PackedCarbowax 20M220.2308.Sellier, Tersac, et al., 1981Column length: 2. m

Van Den Dool and Kratz RI, non-polar column, temperature ramp

View large format table.

Column type Active phase I Reference Comment
CapillaryHP-5MS1517.5Zeng, Zhao, et al., 200730. m/0.25 mm/0.25 μm, He, 4. K/min; Tstart: 80. C; Tend: 300. C
CapillaryDB-51513.0Song, Lai, et al., 200330. m/0.25 mm/0.25 μm, He, 4. K/min; Tstart: 40. C; Tend: 310. C
CapillaryDB-51512.0Song, Lai, et al., 200330. m/0.25 mm/0.25 μm, He, 40. C @ 5. min, 4. K/min; Tend: 310. C
CapillaryDB-51499.4Song, Lai, et al., 200330. m/0.25 mm/0.25 μm, He, 2. K/min; Tstart: 40. C; Tend: 310. C
CapillaryDB-51513.0Song, Lai, et al., 200330. m/0.25 mm/0.25 μm, He, 4. K/min; Tstart: 40. C; Tend: 310. C
CapillaryDB-51520.9Song, Lai, et al., 200330. m/0.25 mm/0.25 μm, He, 6. K/min; Tstart: 40. C; Tend: 310. C
CapillaryOV-11530.0Zhang, Shen, et al., 200025. m/0.2 mm/0.33 μm, 5. K/min; Tstart: 100. C; Tend: 180. C
CapillaryOV-11549.2Zhang, Shen, et al., 200025. m/0.2 mm/0.33 μm, 5. K/min; Tstart: 100. C; Tend: 180. C
CapillaryDB-51499.4Lai and Song, 199530. m/0.25 mm/0.25 μm, He, 2. K/min; Tstart: 40. C; Tend: 310. C
CapillaryDB-51513.Lai and Song, 199530. m/0.25 mm/0.25 μm, He, 4. K/min; Tstart: 40. C; Tend: 310. C
CapillaryDB-51520.9Lai and Song, 199530. m/0.25 mm/0.25 μm, He, 6. K/min; Tstart: 40. C; Tend: 310. C
CapillaryDB-51513.0Lai and Song, 199530. m/0.25 mm/0.25 μm, He, 4. K/min; Tstart: 40. C; Tend: 310. C
CapillaryDB-51512.0Lai and Song, 199530. m/0.25 mm/0.25 μm, He, 40. C @ 5. min, 4. K/min; Tend: 310. C
CapillaryDB-51526.Rostad and Pereira, 198630. m/0.26 mm/0.25 μm, He, 50. C @ 4. min, 6. K/min, 300. C @ 20. min

Van Den Dool and Kratz RI, non-polar column, custom temperature program

View large format table.

Column type Active phase I Reference Comment
CapillaryDB-5MS1545.Varlet V., Knockaert C., et al., 200630. m/0.32 mm/0.5 μm, He; Program: 70C(1min) => 3C/min => 80C(1min) => 5C/min => 150C => 10C/min => 280C (4min)
CapillaryDB-51537.Havenga and Rohwer, 199930. m/0.25 mm/0.25 μm, He; Program: 60 0C 7 0C/min -> 130 0C 5 0C/min -> 200 0C 6 0C/min -> 260 0C 20 0C/min -> 320 0C (4 min)
Capillary5 % Phenyl methyl siloxane1504.Yasuhara, Shiraishi, et al., 199725. m/0.31 mm/0.52 μm, He; Program: 50C(2min) => (20C/min) => 120C => (7C/min) => 310C(10min)

Normal alkane RI, non-polar column, isothermal

View large format table.

Column type Active phase Temperature (C) I Reference Comment
PackedPolydimethyl siloxane147.1499.Ferrand, 1962

Normal alkane RI, non-polar column, temperature ramp

View large format table.

Column type Active phase I Reference Comment
CapillaryHP-5 MS1521.Lazarevic, Radulovic, et al., 201030. m/0.25 mm/0.25 μm, Helium, 5. K/min; Tstart: 70. C; Tend: 290. C
CapillaryZB-51534.Harrison and Priest, 200930. m/0.25 mm/0.25 μm, Helium, 40. C @ 1. min, 6. K/min, 280. C @ 9. min
CapillaryDB-51532.Grung, Lichtenthaler, et al., 200730. m/0.25 mm/0.25 μm, 5. K/min, 280. C @ 10. min; Tstart: 40. C
CapillaryHP-51519.6Leffingwell and Alford, 200560. m/0.32 mm/0.25 μm, He, 30. C @ 2. min, 2. K/min, 260. C @ 28. min
CapillaryOptima-11490.de Beck, Bessière, et al., 200025. m/0.20 mm/0.25 μm, He, 50. C @ 3. min, 3. K/min; Tend: 250. C
CapillaryDB-51493.Andersson and Weis, 199430. m/0.32 mm/0.25 μm, H2, 80. C @ 2. min, 4. K/min, 270. C @ 5. min
CapillaryUltra-11470.Okumura, 199125. m/0.32 mm/0.25 μm, He, 3. K/min; Tstart: 80. C; Tend: 260. C

Normal alkane RI, non-polar column, custom temperature program

View large format table.

Column type Active phase I Reference Comment
CapillaryTR-5 MS1489.Kurashov, Mitrukova, et al., 201415. m/0.25 mm/0.25 μm, Helium; Program: 35 0C (3 min) 2 0C/min -> 60 0C (3 min) 2 0C/min -> 80 0C (3 min) 4 0C/min -> 120 0C (3 min) 5 0C/min -> 150 0C (3 min) 15 0C/min -> 240 0C (10 min)
CapillaryTR-5 MS1501.Kurashov, Krylova, et al., 201315. m/0.25 mm/0.25 μm, Helium; Program: 35 0C (3 min) 2 0C/min -> 60 0C (3 min) 2 0C/min -> 80 0C (3 min) 4 0C/min -> 120 0C (3 min) 5 0C/min -> 150 0C (3 mion) 15 0C/min -> 240 0C (10 min)
CapillaryHP-5MS1515.Ansorena, Gimeno, et al., 200130. m/0.25 mm/0.25 μm, He; Program: 40C (10min) => 3C/min => 120C => 10C/min => 250C (5min)
CapillaryHP-51515.Ansorena, Astiasarán, et al., 200030. m/0.25 mm/0.25 μm, He; Program: 40C (10min) => 3C/min => 120C => 10C/min => 250C (5min)
CapillaryMethyl Silicone1505.Zenkevich, 1994Program: not specified
CapillaryPolydimethyl siloxane, unknown content of Ph-groups1524.Geldon, 1989Program: not specified
CapillaryPolydimethyl siloxane, unknown content of Ph-groups1525.Geldon, 1989Program: not specified
CapillaryOV-1, SE-30, Methyl silicone, SP-2100, OV-101, DB-1, etc.1487.Waggott and Davies, 1984Hydrogen; Column length: 50. m; Column diameter: 0.32 mm; Program: not specified

Normal alkane RI, polar column, temperature ramp

View large format table.

Column type Active phase I Reference Comment
CapillaryTC-Wax2270.Miyazawa and Okuno, 2003He, 4. K/min, 250. C @ 30. min; Column length: 60. m; Column diameter: 0.25 mm; Tstart: 80. C

Lee's RI, non-polar column, temperature ramp

View large format table.

Column type Active phase I Reference Comment
CapillaryHP-5260.3Wang, Hou, et al., 200730. m/0.30 mm/0.25 μm, Helium, 50. C @ 5. min, 5. K/min, 200. C @ 15. min
CapillaryHP-5260.4Shao, Wang, et al., 200630. m/0.3 mm/0.25 μm, He, 50. C @ 5. min, 5. K/min, 200. C @ 15. min
CapillaryHP-5MS252.13Zhou, Wang, et al., 200430. m/0.25 mm/0.25 μm, 65. C @ 5. min, 3. K/min, 290. C @ 20. min
CapillaryDB-5MS259.74Chen, Keeran, et al., 200230. m/0.25 mm/0.5 μm, 40. C @ 1. min, 10. K/min; Tend: 310. C
CapillarySE-52258.72Wang, Peng, et al., 19974. K/min; Column length: 30. m; Column diameter: 0.30 mm; Tstart: 40. C; Tend: 250. C
CapillaryDB-5257.02Andersson and Weis, 199430. m/0.32 mm/0.25 μm, H2, 80. C @ 2. min, 4. K/min, 270. C @ 5. min
CapillaryDB-5259.7Donnelly, Abdel-Hamid, et al., 199330. m/0.32 mm/0.25 μm, He, 40. C @ 3. min, 8. K/min, 285. C @ 29.5 min
CapillarySPB-5259.5Knobloch and Engewald, 199340. C @ 2. min, 4. K/min; Column length: 30. m; Column diameter: 0.25 mm; Tend: 300. C
CapillaryCP Sil 8 CB258.8Bundt, Herbel, et al., 199150. m/0.25 mm/0.25 μm, He, 4. K/min; Tstart: 80. C; Tend: 300. C
CapillaryOV-101259.57Blanco, Blanco, et al., 1989H2, 4. K/min; Column length: 25. m; Column diameter: 0.22 mm; Tstart: 50. C; Tend: 300. C
CapillarySE-52257.12Hasegawa, Muragishi, et al., 19883. K/min; Column length: 25. m; Column diameter: 0.25 mm; Tstart: 130. C; Tend: 260. C
CapillaryDB-5259.07Wise, Benner, et al., 198830. m/0.25 mm/0.25 μm, 40. C @ 2. min, 4. K/min, 280. C @ 5. min
CapillaryDB-5259.75Rostad and Pereira, 198630. m/0.26 mm/0.25 μm, He, 50. C @ 4. min, 6. K/min, 300. C @ 20. min
CapillaryDB-5254.578Tong, Shore, et al., 1984He, 80. C @ 1. min, 3. K/min, 300. C @ 10. min; Column length: 30. m; Column diameter: 0.32 mm
CapillaryDB-5252.5Viau, Studak, et al., 1984Helium, 4. K/min; Column length: 30. m; Column diameter: 0.32 mm; Tstart: 90. C; Tend: 250. C
CapillarySE-52258.77Vassilaros, Kong, et al., 198220. m/0.30 mm/0.25 μm, H2, 40. C @ 2. min, 4. K/min; Tend: 265. C
CapillarySE-52257.17Lee, Vassilaros, et al., 197912. m/0.3 mm/0.34 μm, He, 2. K/min; Tstart: 50. C; Tend: 250. C

References

Sabbah, 1991
Sabbah, R.,
Thermodynamic study of fluorene and dibenzofuran,
Bull. Soc. Chim. Fr., 1991, 128, 350. [all data]
Sabbah and Antipine, 1987
Sabbah, R.; Antipine, I.,
Thermodynamic study on four polycycles. Relationship between their energy values and their structure,
Bull. Soc. Chim. Fr., 1987, 392-400. [all data]
Chirico, Gammon, et al., 1990
Chirico, R.D.; Gammon, B.E.; Knipmeyer, S.E.; Nguyen, A.; Strube, M.M.; Tsonopoulos, C.; Steele, W.V.,
The thermodyanmic properties of dibenzofuran,
J. Chem. Thermodyn., 1990, 22, 1075-1096. [all data]
Klots T.D., 1996
Klots T.D.,
Vibrational spectra, structure, assignment, and ideal-gas thermodynamics of a three-ring molecule: dibenzofuran,
J. Mol. Struct., 1996, 380, 1-14. [all data]
Cass, Fletcher, et al., 1958
Cass, R.C.; Fletcher, S.E.; Mortimer, C.T.; Springall, H.D.; White, T.R.,
Heats of combustion and molecular structure. Part V. The mean bond energy term for the C-O bond in ethers, and the structures of some cyclic ethers,
J. Chem. Soc., 1958, 1406-1410. [all data]
Aldrich Chemical Company Inc., 1990
Aldrich Chemical Company Inc.,
Catalog Handbook of Fine Chemicals, Aldrich Chemical Company, Inc., Milwaukee WI, 1990, 1. [all data]
Weast and Grasselli, 1989
CRC Handbook of Data on Organic Compounds, 2nd Editon, Weast,R.C and Grasselli, J.G., ed(s)., CRC Press, Inc., Boca Raton, FL, 1989, 1. [all data]
Cooper, Crowne, et al., 1967
Cooper, A.R.; Crowne, C.W.P.; Farrell, P.G.,
Gas-Liquid Chromatographic Studies of Electron-Donor-Acceptor Systems,
Trans. Faraday Soc., 1967, 63, 447. [all data]
Chirico, Gammon, et al., 1990, 2
Chirico, R.D.; Gammon, B.E.; Kripmeyer, S.E.; Nguyen, A.; Strube, M.M.; Steele, W.V.,
The thermodynamic properties of dibenzofuran,
J. Chem. Thermodyn., 1990, 22, 11, 1075, https://doi.org/10.1016/0021-9614(90)90157-L
. [all data]
Lei, Chankalal, et al., 2002
Lei, Ying Duan; Chankalal, Raymond; Chan, Anita; Wania, Frank,
Supercooled Liquid Vapor Pressures of the Polycyclic Aromatic Hydrocarbons,
J. Chem. Eng. Data, 2002, 47, 4, 801-806, https://doi.org/10.1021/je0155148
. [all data]
Stephenson and Malanowski, 1987
Stephenson, Richard M.; Malanowski, Stanislaw,
Handbook of the Thermodynamics of Organic Compounds, 1987, https://doi.org/10.1007/978-94-009-3173-2
. [all data]
Cass, Fletcher, et al., 1958, 2
Cass, R.C.; Fletcher, S.E.; Mortimer, C.T.; Springall, H.D.; White, T.R.,
281. Heats of combustion and molecular structure. Part V. The mean bond energy term for the C?O bond in ethers, and the structures of some cyclic ethers,
J. Chem. Soc., 1958, 1406, https://doi.org/10.1039/jr9580001406
. [all data]
Li, Shibata, et al., 2004
Li, Xian-Wei; Shibata, Etsuro; Kasai, Eiki; Nakamura, Takashi,
VAPOR PRESSURES AND ENTHALPIES OF SUBLIMATION OF 17 POLYCHLORINATED DIBENZO-p-DIOXINS AND FIVE POLYCHLORINATED DIBENZOFURANS,
Environ Toxicol Chem, 2004, 23, 2, 348-808, https://doi.org/10.1897/03-193
. [all data]
Rordorf, 1989
Rordorf, Berchtold F.,
Prediction of vapor pressures, boiling points and enthalpies of fusion for twenty-nine halogenated dibenzo-p-dioxins and fifty-five dibenzofurans by a vapor pressure correlation method,
Chemosphere, 1989, 18, 1-6, 783-788, https://doi.org/10.1016/0045-6535(89)90196-3
. [all data]
Rordorf, 1986
Rordorf, Berchtold F.,
Thermal properties of dioxins, furans and related compounds,
Chemosphere, 1986, 15, 9-12, 1325-1332, https://doi.org/10.1016/0045-6535(86)90407-8
. [all data]
Hansen and Eckert, 1986
Hansen, Philip C.; Eckert, Charles A.,
An improved transpiration method for the measurement of very low vapor pressures,
J. Chem. Eng. Data, 1986, 31, 1, 1-3, https://doi.org/10.1021/je00043a001
. [all data]
SATO, INOMATA, et al., 1986
SATO, NOBUYUKI; INOMATA, HIROSHI; ARAI, KUNIO; SAITO, SHOZABURO,
Measurement of vapor pressures for coal-related aromatic compounds by gas saturation method.,
J. Chem. Eng. Japan / JCEJ, 1986, 19, 2, 145-147, https://doi.org/10.1252/jcej.19.145
. [all data]
Kestens, Auclair, et al., 2010
Kestens, Vikram; Auclair, Guy; Drozdzewska, Katarzyna; Held, Andrea; Roebben, Gert; Linsinger, Thomas,
Thermodynamic property values of selected polycyclic aromatic hydrocarbons measured by differential scanning calorimetry,
J Therm Anal Calorim, 2010, 99, 1, 245-261, https://doi.org/10.1007/s10973-009-0440-6
. [all data]
Hafsaoui and Mahmoud, 2007
Hafsaoui, S.L.; Mahmoud, R.,
Solid-liquid equilibria of binary systems containing n-tetracosane with naphthalene or dibenzofuran,
J Therm Anal Calorim, 2007, 88, 2, 565-570, https://doi.org/10.1007/s10973-006-8084-2
. [all data]
Lisicki and Jamróz, 2000
Lisicki, Zygmunt; Jamróz, Malgorzata E.,
(Solid + liquid) equilibria in (polynuclear aromatic+ tertiary amide) systems,
The Journal of Chemical Thermodynamics, 2000, 32, 10, 1335-1353, https://doi.org/10.1006/jcht.2000.0685
. [all data]
Mahmoud, Solimando, et al., 2000
Mahmoud, R.; Solimando, R.; Bouroukba, M.; Rogalski, M.,
Solid-Liquid Equilibrium and Excess Enthalpy Measurements in Binary {Dibenzofuran or Xanthene + Normal Long-Chain Alkane} Systems,
J. Chem. Eng. Data, 2000, 45, 3, 433-436, https://doi.org/10.1021/je9902084
. [all data]
Terlouw, Heerma, et al., 1974
Terlouw, J.K.; Heerma, W.; Frintrop, P.C.M.; Dijkstra, G.; Meinema, H.A.,
Electron-impact induced fragmentation of some heterocyclic-tin compounds,
J. Organomet. Chem., 1974, 64, 205. [all data]
Dewar, Harget, et al., 1970
Dewar, M.J.S.; Harget, A.J.; Trinajstic, N.; Worley, S.D.,
Ground states of conjugated molecules-XXI.Benzofurans and benzopyrroles,
Tetrahedron, 1970, 26, 4505. [all data]
Eland, 1969
Eland, J.H.D.,
Photoelectron spectra of conjugated hydrocarbons and heteromolecules,
Intern. J. Mass Spectrom. Ion Phys., 1969, 2, 471. [all data]
Ruscic, Kovac, et al., 1978
Ruscic, B.; Kovac, B.; Klasinc, L.; Gusten, H.,
Photoelectron spectroscopy of J. Heterocycl. Chem.. Fluorene analogues,
Z. Naturforsch. A:, 1978, 33, 1006. [all data]