methoxypropanol
- Formula: C4H10O2
- Molecular weight: 90.1210
- IUPAC Standard InChIKey: JDFDHBSESGTDAL-UHFFFAOYSA-N
- CAS Registry Number: 1320-67-8
- Chemical structure:
View 3d structure (requires JavaScript / HTML 5) - Species with the same structure:
- Other names: Propanol, 3-methoxy-

Gas phase ion energetics data

Data compiled as indicated in comments:
LBLHLM - Sharon G. Lias, John E. Bartmess, Joel F. Liebman, John L. Holmes, Rhoda D. Levin, and W. Gary Mallard
Ionization energy determinations
IE (eV) | Method | Reference | Comment |
---|---|---|---|
9.3 | PE | Biermann and Morton, 1983 | LBLHLM |
10.0 | PE | Biermann and Morton, 1983 | Vertical value; LBLHLM |

References

Biermann and Morton, 1983
Biermann, H.W.; Morton, T.H.,
Reversible tautomerization of radical cations. Photoionization of 2-methoxyethanol and 3-methoxy-1-propanol,
J. Am. Chem. Soc., 1983, 105, 5025. [all data]