2-Butenoic acid, 2-methyl-
- Formula: C5H8O2
- Molecular weight: 100.1158
- IUPAC Standard InChIKey: UIERETOOQGIECD-UHFFFAOYSA-N
- CAS Registry Number: 13201-46-2
- Chemical structure:
View 3d structure (requires JavaScript / HTML 5) - Stereoisomers:
- Other names: Crotonic acid, 2-methyl-; 2-Methyl-2-butenoic acid; CH3CH=C(CH3)COOH; α-Methylcrotonic acid; 2-Methylcrotonic acid

Phase change data

Data compiled by: Thermodynamics Research Center, NIST Boulder Laboratories, Chris Muzny director
Quantity | Value | Units | Method | Reference | Comment |
---|---|---|---|---|---|
Tfus | 343. | K | N/A | Kern, Shriner, et al., 1925 | Uncertainty assigned by TRC = 2. K |

Gas phase ion energetics data

Data compiled as indicated in comments:
LLK - Sharon G. Lias, Rhoda D. Levin, and Sherif A. Kafafi
Ionization energy determinations
IE (eV) | Method | Reference | Comment |
---|---|---|---|
9.50 | PE | Holmes, Terlouw, et al., 1979 | LLK |

Normal alkane RI, polar column, temperature ramp

Data compiled by: NIST Mass Spectrometry Data Center, William E. Wallace, director

Column type CapillaryCapillary
Active phase CP Wax 52 CBHP-Innowax
Column length (m) 30.15.
Carrier gas Helium
Substrate
Column diameter (mm) 0.320.25
Phase thickness (μm) 0.501.
Tstart (C) 40.45.
Tend (C) 230.210.
Heat rate (K/min) 4.10.
Initial hold (min) 2.5.
Final hold (min) 15.5.
I 1851.1835.
ReferenceBirtic, Ginies, et al., 2009Wijaya, Ulrich, et al., 2005
Comment MSDC-RI MSDC-RI

Normal alkane RI, non-polar column, temperature ramp

Data compiled by: NIST Mass Spectrometry Data Center, William E. Wallace, director

Column type Capillary
Active phase RSL-200
Column length (m) 30.
Carrier gas H2
Substrate
Column diameter (mm) 0.32
Phase thickness (μm) 0.25
Tstart (C) 40.
Tend (C) 280.
Heat rate (K/min) 6.
Initial hold (min) 5.
Final hold (min) 5.
I 934.
ReferenceNgassoum, Jirovetz, et al., 2001
Comment MSDC-RI

References

Kern, Shriner, et al., 1925
Kern, J.W.; Shriner, R.L.; Adams, R.,
Platinum and Palladium Oxides as Catalysts in the Reduction of Organic Compounds IX. The Reduction of Olefins,
J. Am. Chem. Soc., 1925, 47, 1147. [all data]
Holmes, Terlouw, et al., 1979
Holmes, J.L.; Terlouw, J.K.; Vijfhuizen, P.C.; A'Campo, C.,
Metastable ion studies XII-Molecular and fragment ion structures for isomeric C4H6O2 acids,
Org. Mass Spectrom., 1979, 14, 204. [all data]