Pyrazine,tetrafluoro-
- Formula: C4F4N2
- Molecular weight: 152.0498
- IUPAC Standard InChIKey: VFTWLRXDHOBEDB-UHFFFAOYSA-N
- CAS Registry Number: 13177-77-0
- Chemical structure:
View 3d structure (requires JavaScript / HTML 5) - Permanent link for this species. Use this link for bookmarking this species for future reference.

Gas phase ion energetics data

Data compiled by: Sharon G. Lias, Rhoda D. Levin, and Sherif A. Kafafi
Ionization energy determinations
IE (eV) | Method | Reference | Comment |
---|---|---|---|
10.37 | PE | Van den Ham, Van der Meer, et al., 1974 | Vertical value |
10.34 | PE | Suffolk, 1974 | Vertical value |

References

Van den Ham, Van der Meer, et al., 1974
Van den Ham, D.M.W.; Van der Meer, D.; Feil, D.,
Photoelectron spectra of fluorine-substituted diazabenzenes,
J. Electron Spectrosc. Relat. Phenom., 1974, 3, 479. [all data]
Suffolk, 1974
Suffolk, R.J.,
The photoelectron spectra of the perfluorodiazines,
J. Electron Spectrosc. Relat. Phenom., 1974, 3, 53. [all data]