Propyne, 1-methoxy
- Formula: C4H6O
- Molecular weight: 70.0898
- IUPAC Standard InChIKey: QKBBSZTVZOCUAD-UHFFFAOYSA-N
- CAS Registry Number: 13169-01-2
- Chemical structure:
View 3d structure (requires JavaScript / HTML 5) - Other names: Prop-1-yne, 1-methoxy-

Gas phase ion energetics data

Data compiled as indicated in comments:
LBLHLM - Sharon G. Lias, John E. Bartmess, Joel F. Liebman, John L. Holmes, Rhoda D. Levin, and W. Gary Mallard
Ionization energy determinations
IE (eV) | Method | Reference | Comment |
---|---|---|---|
8.79 | EI | Holmes and Lossing, 1986 | LBLHLM |

References

Holmes and Lossing, 1986
Holmes, J.L.; Lossing, F.P.,
Title unavailable,
Personal communication to S.G. Lias, 1986. [all data]