1,2-Propadiene, 3-methoxy-
- Formula: C4H6O
- Molecular weight: 70.0898
- IUPAC Standard InChIKey: RRWJXAJEGRDMQH-UHFFFAOYSA-N
- CAS Registry Number: 13169-00-1
- Chemical structure:
View 3d structure (requires JavaScript / HTML 5) - Permanent link for this species. Use this link for bookmarking this species for future reference.

Gas phase ion energetics data

Data compiled as indicated in comments:
LBLHLM - Sharon G. Lias, John E. Bartmess, Joel F. Liebman, John L. Holmes, Rhoda D. Levin, and W. Gary Mallard
LLK - Sharon G. Lias, Rhoda D. Levin, and Sherif A. Kafafi
Ionization energy determinations
IE (eV) | Method | Reference | Comment |
---|---|---|---|
8.64 | EI | Holmes and Lossing, 1986 | LBLHLM |
8.75 | PE | Kroner, Kosbahn, et al., 1977 | Vertical value; LLK |

References

Holmes and Lossing, 1986
Holmes, J.L.; Lossing, F.P.,
Title unavailable,
Personal communication to S.G. Lias, 1986. [all data]
Kroner, Kosbahn, et al., 1977
Kroner, J.; Kosbahn, W.; Runge, W.,
The molecular structure of allenes and ketenes, IX[1]π and σ interactions in allenes: Photoelectron spectra, electronic absorption spectra, and quantum chemical calculations,
Ber. Bunsen-Ges. Phys. Chem., 1977, 81, 826. [all data]