Cycloundecene(E)
- Formula: C11H20
- Molecular weight: 152.2765
- IUPAC Standard InChIKey: GMUVJAZTJOCSND-OWOJBTEDSA-N
- CAS Registry Number: 13151-60-5
- Chemical structure:
View 3d structure (requires JavaScript / HTML 5) - Stereoisomers:
- Other names: (E)-Cycloundecene; trans-Cycloundecene; t-Cycloundecene

Gas phase ion energetics data

Data compiled by: Sharon G. Lias, Rhoda D. Levin, and Sherif A. Kafafi
Ionization energy determinations
IE (eV) | Method | Reference |
---|---|---|
8.73 ± 0.15 | EI | Remane, Graefe, et al., 1972 |

Kovats' RI, non-polar column, isothermal

Column type | Active phase | Temperature (C) | I | Reference | Comment |
---|---|---|---|---|---|
Capillary | OV-1 | 100. | 1201.8 | Engewald, Billing, et al., 1987 | Column length: 50. m; Column diameter: 0.3 mm |
Packed | Squalane | 120. | 1214. | Bogoslovsky, Anvaer, et al., 1978 | |
Capillary | Squalane | 120. | 1214. | Engewald, Epsch, et al., 1974 | N2; Column length: 100. m; Column diameter: 0.23 mm |
Capillary | Squalane | 120. | 1214. | Schomburg, 1966 |

References

Remane, Graefe, et al., 1972
Remane, H.; Graefe, J.; Herzschuh, R.,
Ionisationspotentiale von cis- und trans-Cycloalkenen,
Z. Chem., 1972, 12, 194. [all data]
Engewald, Billing, et al., 1987
Engewald, W.; Billing, U.; Welsch, T.; Haufe, G.,
Structure-retention correlations of hydrocarbons in gas-liquid and gas-solid chromatography. Cycloalkenes and cycloalkadienes,
Chromatographia, 1987, 23, 8, 590-594, https://doi.org/10.1007/BF02324870
. [all data]
Bogoslovsky, Anvaer, et al., 1978
Bogoslovsky, Yu.N.; Anvaer, B.I.; Vigdergauz, M.S.,
Chromatographic constants in gas chromatography (in Russian), Standards Publ. House, Moscow, 1978, 192. [all data]
Engewald, Epsch, et al., 1974
Engewald, W.; Epsch, K.; Graefe, J.; Welsch, Th.,
Molekülstruktur und retentionsverhalten. II. Retentionsverhalten cycloaliphatischer kohlenwasser-stoffe bei der gas-adsorptions- und gas-verteilungschromatographie,
J. Chromatogr., 1974, 91, 623-631, https://doi.org/10.1016/S0021-9673(01)97943-9
. [all data]
Schomburg, 1966
Schomburg, G.,
Gaschromatographische Retentionsdaten und struktur chemischer verbindungen. III. Alkylverzweigte und ungesättigte cyclische Kohlenwasserstoffe,
J. Chromatogr., 1966, 23, 18-41, https://doi.org/10.1016/S0021-9673(01)98653-4
. [all data]