cis-1,3-Dimethylcycloheptane
- Formula: C9H18
- Molecular weight: 126.2392
- IUPAC Standard InChIKey: PTWXFJWKUMXFLI-DTORHVGOSA-N
- CAS Registry Number: 13151-53-6
- Chemical structure:
View 3d structure (requires JavaScript / HTML 5) - Stereoisomers:

Gas phase ion energetics data

Data compiled as indicated in comments:
LL - Sharon G. Lias and Joel F. Liebman
LLK - Sharon G. Lias, Rhoda D. Levin, and Sherif A. Kafafi
Ionization energy determinations
IE (eV) | Method | Reference | Comment |
---|---|---|---|
10.41 | EI | Herzschuh and Mitrach, 1992 | LL |
10.41 ± 0.05 | EI | Herzschuh and Sicker, 1981 | LLK |
Appearance energy determinations
Ion | AE (eV) | Other Products | Method | Reference | Comment |
---|---|---|---|---|---|
C7H13+ | 11.14 | C2H5 | EI | Herzschuh and Mitrach, 1992 | LL |
C7H13+ | 11.14 ± 0.05 | C2H5 | EI | Herzschuh and Sicker, 1981 | LLK |
C8H15+ | 10.91 | CH3 | EI | Herzschuh and Mitrach, 1992 | LL |
C8H15+ | 10.91 ± 0.05 | CH3 | EI | Herzschuh and Sicker, 1981 | LLK |

Kovats' RI, non-polar column, isothermal

Column type | Active phase | Temperature (C) | I | Reference | Comment |
---|---|---|---|---|---|
Capillary | Squalane | 70. | 920. | Schomburg, 1966 |

References

Herzschuh and Mitrach, 1992
Herzschuh, R.; Mitrach, K.,
Zum Einfluss stereochemisch bedingter Enthalpieunterschiede auf die elektronenstossinduzierte Fragmentierung isomerer Dimethylcycloheptane,
J. Prakt. Chem., 1992, 334, 135. [all data]
Herzschuh and Sicker, 1981
Herzschuh, R.; Sicker, A.,
Stereochemische einflusse auf die ionisations- und auftrittsenergien cis/trans-isomerer dimethylcycloalkane,
Z. Chem., 1981, 21, 409. [all data]
Schomburg, 1966
Schomburg, G.,
Gaschromatographische Retentionsdaten und struktur chemischer verbindungen. III. Alkylverzweigte und ungesättigte cyclische Kohlenwasserstoffe,
J. Chromatogr., 1966, 23, 18-41, https://doi.org/10.1016/S0021-9673(01)98653-4
. [all data]