tin sulphide
- Formula: SSn
- Molecular weight: 150.775
- IUPAC Standard InChIKey: AFNRRBXCCXDRPS-UHFFFAOYSA-N
- CAS Registry Number: 1314-95-0
- Chemical structure:
View 3d structure (requires JavaScript / HTML 5) - Other names: Tin monosulfide

Gas phase ion energetics data

Data compiled as indicated in comments:
LLK - Sharon G. Lias, Rhoda D. Levin, and Sherif A. Kafafi
RDSH - Henry M. Rosenstock, Keith Draxl, Bruce W. Steiner, and John T. Herron
Ionization energy determinations
IE (eV) | Method | Reference | Comment |
---|---|---|---|
9.7 ± 0.5 | EI | Colin and Drowart, 1962 | RDSH |
9.42 | PE | White, Rosenberg, et al., 1979 | Vertical value; LLK |
10.20 | PE | Wu and Fehlner, 1976 | Vertical value; LLK |
9.7 ± 0.5 | EI | Wu and Fehlner, 1976 | Vertical value; LLK |
Appearance energy determinations
Ion | AE (eV) | Other Products | Method | Reference | Comment |
---|---|---|---|---|---|
S+ | 16.5 ± 2.0 | Sn | EI | Colin and Drowart, 1962 | RDSH |
Sn+ | 12.5 ± 0.5 | S | EI | Colin and Drowart, 1962 | RDSH |

Constants of diatomic molecules

Data compiled by: Klaus P. Huber and Gerhard H. Herzberg
Data collected through August, 1977
Symbol | Meaning |
---|---|
State | electronic state and / or symmetry symbol |
Te | minimum electronic energy (cm-1) |
ωe | vibrational constant – first term (cm-1) |
ωexe | vibrational constant – second term (cm-1) |
ωeye | vibrational constant – third term (cm-1) |
Be | rotational constant in equilibrium position (cm-1) |
αe | rotational constant – first term (cm-1) |
γe | rotation-vibration interaction constant (cm-1) |
De | centrifugal distortion constant (cm-1) |
βe | rotational constant – first term, centrifugal force (cm-1) |
re | internuclear distance (Å) |
Trans. | observed transition(s) corresponding to electronic state |
ν00 | position of 0-0 band (units noted in table) |
State | Te | ωe | ωexe | ωeye | Be | αe | γe | De | βe | re | Trans. | ν00 |
---|---|---|---|---|---|---|---|---|---|---|---|---|
Continuous absorption from 56470 to 56887 cm-1. | ||||||||||||
↳Barrow, Drummond, et al., 1953 | ||||||||||||
G 2 | [56171] 1 | G ← X R | 55928 H | |||||||||
↳Barrow, Drummond, et al., 1953 | ||||||||||||
F 2 | (52257) | (408) H | (4.5) | F ← X R | 52217 H | |||||||
↳Barrow, Drummond, et al., 1953 | ||||||||||||
E 1Σ+ | 33037.0 | 294.25 H | 1.15 | E ↔ X R | 32941 H | |||||||
↳missing citation; Barrow, Drummond, et al., 1953; Douglas, Howe, et al., 1961 | ||||||||||||
State | Te | ωe | ωexe | ωeye | Be | αe | γe | De | βe | re | Trans. | ν00 |
D 1Π | 28336.60 | 331.35 Z | 1.265 | 0.12023 3 4 | 0.00070 | 2.3569 | D ↔ X R | 28258.67 Z | ||||
↳missing citation; Douglas, Howe, et al., 1961 | ||||||||||||
The spectrum in the visible and near UV region is very complex, both in absorption and in emission Rochester, 1935 Douglas, Howe, et al., 1961 Yamdagni and Joshi, 1966; partial analysis by Douglas, Howe, et al., 1961: | ||||||||||||
C' 1 | [23950.3] 5 | [0.1075] | [2.493] | C' ↔ X R | 23707.0 Z | |||||||
↳Douglas, Howe, et al., 1961 | ||||||||||||
B 1 | (23589.8) | [366.60] 6 Z | [0.1214] | 7 | [2.345] | B ↔ X R | 23529.82 Z | |||||
↳Douglas, Howe, et al., 1961 | ||||||||||||
State | Te | ωe | ωexe | ωeye | Be | αe | γe | De | βe | re | Trans. | ν00 |
A 0+ | [22915.97] 8 | [0.1184] | [2.375] | A ↔ X R | 22672.68 Z | |||||||
↳Douglas, Howe, et al., 1961 | ||||||||||||
a 9 | a → X | (18300) | ||||||||||
↳Smith and Meyer, 1968 | ||||||||||||
X 1Σ+ | 0 | 487.26 Z | 1.358 | 0.13686139 4 | 0.00050563 10 | 4.24E-8 | 2.209026 11 | |||||
↳Marino, Guerin, et al., 1974 | ||||||||||||
Microwave sp. 6 | ||||||||||||
↳Barrow, Fry, et al., 1963 |

References

Colin and Drowart, 1962
Colin, R.; Drowart, J.,
Thermodynamic study of tin sulfide and lead sulfide using a mass spectrometer,
J. Chem. Phys., 1962, 37, 1120. [all data]
White, Rosenberg, et al., 1979
White, M.G.; Rosenberg, R.A.; Lee, S.T.; Shirley, D.A.,
The He(I) photoelectron spectroscopy of heavy group IV-VI diatomics,
J. Electron Spectrosc. Relat. Phenom., 1979, 17, 323. [all data]
Wu and Fehlner, 1976
Wu, M.; Fehlner, T.P.,
Valence level photoelectron spectra of some heavy group 4-6 diatomic molecules,
J. Am. Chem. Soc., 1976, 98, 7578. [all data]