lead sulphide
- Formula: PbS
- Molecular weight: 239.3
- IUPAC Standard InChIKey: XCAUINMIESBTBL-UHFFFAOYSA-N
- CAS Registry Number: 1314-87-0
- Chemical structure:
View 3d structure (requires JavaScript / HTML 5) - Other names: Lead monosulfide

Gas phase thermochemistry data

Quantity | Value | Units | Method | Reference | Comment |
---|---|---|---|---|---|
ΔfH°gas | 131.80 | kJ/mol | Review | Chase, 1998 | Data last reviewed in June, 1973 |
Quantity | Value | Units | Method | Reference | Comment |
S°gas,1 bar | 251.41 | J/mol*K | Review | Chase, 1998 | Data last reviewed in June, 1973 |
Gas Phase Heat Capacity (Shomate Equation)
Cp° = A + B*t + C*t2 + D*t3 +
E/t2
H° − H°298.15= A*t + B*t2/2 +
C*t3/3 + D*t4/4 − E/t + F − H
S° = A*ln(t) + B*t + C*t2/2 + D*t3/3 −
E/(2*t2) + G
Cp = heat capacity (J/mol*K)
H° = standard enthalpy (kJ/mol)
S° = standard entropy (J/mol*K)
t = temperature (K) / 1000.
View plot Requires a JavaScript / HTML 5 canvas capable browser.
Temperature (K) | 2000. to 6000. |
---|---|
A | 77.88139 |
B | -29.77217 |
C | 7.546932 |
D | -0.510226 |
E | -25.06680 |
F | 68.59375 |
G | 310.5700 |
H | 131.7960 |
Reference | Chase, 1998 |
Comment | Data last reviewed in June, 1973 |

Condensed phase thermochemistry data

Quantity | Value | Units | Method | Reference | Comment |
---|---|---|---|---|---|
ΔfH°liquid | -84.06 | kJ/mol | Review | Chase, 1998 | Data last reviewed in June, 1973 |
Quantity | Value | Units | Method | Reference | Comment |
S°liquid,1 bar | 100.79 | J/mol*K | Review | Chase, 1998 | Data last reviewed in June, 1973 |
Quantity | Value | Units | Method | Reference | Comment |
ΔfH°solid | -98.32 | kJ/mol | Review | Chase, 1998 | Data last reviewed in June, 1973 |
Quantity | Value | Units | Method | Reference | Comment |
S°solid | 91.34 | J/mol*K | Review | Chase, 1998 | Data last reviewed in June, 1973 |
Liquid Phase Heat Capacity (Shomate Equation)
Cp° = A + B*t + C*t2 + D*t3 +
E/t2
H° − H°298.15= A*t + B*t2/2 +
C*t3/3 + D*t4/4 − E/t + F − H
S° = A*ln(t) + B*t + C*t2/2 + D*t3/3 −
E/(2*t2) + G
Cp = heat capacity (J/mol*K)
H° = standard enthalpy (kJ/mol)
S° = standard entropy (J/mol*K)
t = temperature (K) / 1000.
View plot Requires a JavaScript / HTML 5 canvas capable browser.
Temperature (K) | 1386.5 to 2000. |
---|---|
A | 66.94400 |
B | -7.464048×10-8 |
C | 3.789779×10-8 |
D | -6.666954×10-9 |
E | -1.003106×10-8 |
F | -112.7914 |
G | 165.1312 |
H | -84.06409 |
Reference | Chase, 1998 |
Comment | Data last reviewed in June, 1973 |
Solid Phase Heat Capacity (Shomate Equation)
Cp° = A + B*t + C*t2 + D*t3 +
E/t2
H° − H°298.15= A*t + B*t2/2 +
C*t3/3 + D*t4/4 − E/t + F − H
S° = A*ln(t) + B*t + C*t2/2 + D*t3/3 −
E/(2*t2) + G
Cp = heat capacity (J/mol*K)
H° = standard enthalpy (kJ/mol)
S° = standard entropy (J/mol*K)
t = temperature (K) / 1000.
View plot Requires a JavaScript / HTML 5 canvas capable browser.
Temperature (K) | 298. to 1386.5 |
---|---|
A | 47.38087 |
B | 7.550530 |
C | 2.008094 |
D | -0.700460 |
E | -0.031834 |
F | -112.9115 |
G | 146.1605 |
H | -98.32400 |
Reference | Chase, 1998 |
Comment | Data last reviewed in June, 1973 |

Gas phase ion energetics data

Data evaluated as indicated in comments:
L - Sharon G. Lias
Data compiled as indicated in comments:
RDSH - Henry M. Rosenstock, Keith Draxl, Bruce W. Steiner, and John T. Herron
Quantity | Value | Units | Method | Reference | Comment |
---|---|---|---|---|---|
IE (evaluated) | 8.5 ± 0.5 | eV | N/A | N/A | L |
Ionization energy determinations
IE (eV) | Method | Reference | Comment |
---|---|---|---|
8.4 ± 0.5 | EI | Uy and Drowart, 1969 | RDSH |
8.6 ± 0.5 | EI | Colin and Drowart, 1962 | RDSH |
Appearance energy determinations
Ion | AE (eV) | Other Products | Method | Reference | Comment |
---|---|---|---|---|---|
Pb+ | 11.6 ± 0.5 | S | EI | Colin and Drowart, 1962 | RDSH |
S+ | 16.0 ± 2.0 | Pb | EI | Colin and Drowart, 1962 | RDSH |

Constants of diatomic molecules

Data compiled by: Klaus P. Huber and Gerhard H. Herzberg
Symbol | Meaning |
---|---|
State | electronic state and / or symmetry symbol |
Te | minimum electronic energy (cm-1) |
ωe | vibrational constant – first term (cm-1) |
ωexe | vibrational constant – second term (cm-1) |
ωeye | vibrational constant – third term (cm-1) |
Be | rotational constant in equilibrium position (cm-1) |
αe | rotational constant – first term (cm-1) |
γe | rotation-vibration interaction constant (cm-1) |
De | centrifugal distortion constant (cm-1) |
βe | rotational constant – first term, centrifugal force (cm-1) |
re | internuclear distance (Å) |
Trans. | observed transition(s) corresponding to electronic state |
ν00 | position of 0-0 band (units noted in table) |
State | Te | ωe | ωexe | ωeye | Be | αe | γe | De | βe | re | Trans. | ν00 |
---|---|---|---|---|---|---|---|---|---|---|---|---|
F | 47770 | 370 H | (7.8) | F ← X R | 47729.5 1 H | |||||||
↳missing citation | ||||||||||||
E (0+) | (34000) 2 | E ← X | ||||||||||
↳missing citation | ||||||||||||
D 1 | 29653.2 | 297.83 Z | 1.365 | 0.10160 3 | 0.00064 | 2.447 | D ← X 4 R | 29587.4 Z | ||||
↳Rochester and Howell, 1935; Barrow, Fry, et al., 1963 | ||||||||||||
C' (1) | 25024.4 | 283.95 H | 1.171 | C' ← X R | 24952.3 H | |||||||
↳Rochester and Howell, 1935 | ||||||||||||
State | Te | ωe | ωexe | ωeye | Be | αe | γe | De | βe | re | Trans. | ν00 |
C (0+) | 23212.9 | 303.93 H | 1.436 | C ← X R | 23150.7 H | |||||||
↳Rochester and Howell, 1935 | ||||||||||||
B 1 | 21847.4 | 282.17 H | 0.856 | 0.09992 3 | 0.000602 | 2.467 | B ← X 4 R | 21774.5 H | ||||
↳missing citation; Barrow, Fry, et al., 1963 | ||||||||||||
A 0+ | 18853.0 | 260.83 Z | 0.363 | 0.09634 3 | 0.000262 | 2.513 | A ← X 4 R | 18768.9 Z | ||||
↳missing citation; Barrow, Fry, et al., 1963 | ||||||||||||
a 1 | 14892.9 | 285.9 H | (0.88) | 0.09267 | 0.000374 | 2.562 | a ← X 4 R | 14821.9 Z | ||||
↳Barrow, Fry, et al., 1963 | ||||||||||||
State | Te | ωe | ωexe | ωeye | Be | αe | γe | De | βe | re | Trans. | ν00 |
X 1Σ+ | 0 | 429.40 Z | 1.30 | 0.11631868 5 3 | 0.00043509 6 | 3.415E-8 | 1.3E-10 | 2.286863 7 | ||||
↳Marino, Guerin, et al., 1974 | ||||||||||||
Rotation sp. 8 | ||||||||||||
↳Hoeft, Lovas, et al., 1969; Tiemann, Stieda, et al., 1975 |

References

Chase, 1998
Chase, M.W., Jr.,
NIST-JANAF Themochemical Tables, Fourth Edition,
J. Phys. Chem. Ref. Data, Monograph 9, 1998, 1-1951. [all data]
Uy and Drowart, 1969
Uy, O.M.; Drowart, J.,
Mass spectrometric determination of the dissociation energies of the molecules BiO, BiS, BiSe and BiTe,
J. Chem. Soc. Faraday Trans., 1969, 65, 3221. [all data]
Colin and Drowart, 1962
Colin, R.; Drowart, J.,
Thermodynamic study of tin sulfide and lead sulfide using a mass spectrometer,
J. Chem. Phys., 1962, 37, 1120. [all data]
Rochester and Howell, 1935
Rochester, G.D.; Howell, H.G.,
The vibrational analysis of the absorption spectrum of lead sulphide,
Proc. R. Soc. London A, 1935, 148, 157. [all data]
Barrow, Fry, et al., 1963
Barrow, R.F.; Fry, P.W.; Le Bargy, R.C.,
Rotational analysis of bands of the absorption spectrum of PbS,
Proc. Phys. Soc. London, 1963, 81, 697. [all data]
Marino, Guerin, et al., 1974
Marino, C.P.; Guerin, J.D.; Nixon, E.R.,
Infrared spectra of some matrix-isolated germanium, tin, and lead chalcogenides,
J. Mol. Spectrosc., 1974, 51, 160. [all data]
Hoeft, Lovas, et al., 1969
Hoeft, J.; Lovas, F.J.; Tiemann, E.; Tischer, R.; Torring, T.,
Elektrisches Dipolmoment und Mikrowellenrotationsspektrum von SnO, SnS, PbO und PbS,
Z. Naturforsch. A, 1969, 24, 1222. [all data]
Tiemann, Stieda, et al., 1975
Tiemann, E.; Stieda, W.U.; Torring, T.; Hoeft, J.,
Adiabatische Korrektur der Born-Oppenheimer-Naherung beim PbS,
Z. Naturforsch. A, 1975, 30, 1606. [all data]
Nair, Singh, et al., 1965
Nair, K.P.R.; Singh, R.B.; Rai, D.K.,
Potential-energy curves and dissociation energies of oxides and sulfides of group IV A elements,
J. Chem. Phys., 1965, 43, 3570. [all data]
Teichman and Nixon, 1975
Teichman, R.A., III; Nixon, E.R.,
The A → X emission spectra of PbS and PbSe in neon matrices: enhanced emission from isotopes and matrix sites,
J. Mol. Spectrosc., 1975, 57, 14. [all data]
Murty and Curl, 1969
Murty, A.N.; Curl, R.F., Jr.,
Dipole moments of the sulfides of Pb, Sn, and Si from Stark effect measurements,
J. Mol. Spectrosc., 1969, 30, 102. [all data]
Vago and Barrow, 1947
Vago, E.E.; Barrow, R.F.,
Ultra-violet absorption band-systems of PbO, PbS, PbSe and PbTe,
Proc. Phys. Soc. London, 1947, 59, 449. [all data]