Bicyclo[2.2.1]hept-2-en-7-ol, syn-

Gas phase ion energetics data

Data compiled by: Sharon G. Lias, Rhoda D. Levin, and Sherif A. Kafafi

Ionization energy determinations

IE (eV) Method Reference Comment
9.41PEBrown, 1976Vertical value

References

Brown, 1976
Brown, R.S., Application of photoelectron spectroscopy to intramolecularly hydrogen-bonded systems. Part IV. π-systems; the photoelectron spectra of syn- and anti-7-norbornenol, Can. J. Chem., 1976, 54, 3206. [all data]