Dimethyl phthalate
- Formula: C10H10O4
- Molecular weight: 194.1840
- IUPAC Standard InChIKey: NIQCNGHVCWTJSM-UHFFFAOYSA-N
- CAS Registry Number: 131-11-3
- Chemical structure:
View 3d structure (requires JavaScript / HTML 5) - Other names: 1,2-Benzenedicarboxylic acid, dimethyl ester; Phthalic acid, dimethyl ester; Avolin; Dimethyl 1,2-benzenedicarboxylate; DMF, Insect repellent; DMP; Fermine; Mipax; NTM; Palatinol M; Solvanom; Solvarone; Unimoll DM; Dimethyl benzeneorthodicarboxylate; Dimethyl orthophthalate; Dimethyl benzene-o-dicarboxylate; Dimethyl o-phthalate; ENT 262; Phthalsaeuredimethylester; Dimethyl 1,2-benzendicarboxylate; Kemester DMP; Kodaflex DMP; Repeftal; Uniplex 110; 1,2-dimethyl phthalate; 1,2-Benzenedicarboxylic acid, 1,2-dimethyl ester; NSC 15398; 64441-70-9

Gas phase thermochemistry data

Data compiled by: Hussein Y. Afeefy, Joel F. Liebman, and Stephen E. Stein
Quantity | Value | Units | Method | Reference | Comment |
---|---|---|---|---|---|
ΔfH°gas | -606.1 ± 2.7 | kJ/mol | Ccb | Roux, Jimenez, et al., 1998 |

Condensed phase thermochemistry data

Data compiled as indicated in comments:
ALS - Hussein Y. Afeefy, Joel F. Liebman, and Stephen E. Stein
DH - Eugene S. Domalski and Elizabeth D. Hearing
Quantity | Value | Units | Method | Reference | Comment |
---|---|---|---|---|---|
ΔcH°liquid | -4702.0 | kJ/mol | Ccb | Handrick, 1956 | Naval Powder Factory, 1952; Corresponding ΔfHºliquid = -662.3 kJ/mol (simple calculation by NIST; no Washburn corrections); ALS |
Quantity | Value | Units | Method | Reference | Comment |
S°liquid | 365.5 | J/mol*K | N/A | Martynenko, Rabinovich, et al., 1970 | DH |
Quantity | Value | Units | Method | Reference | Comment |
ΔfH°solid | -683.8 ± 2.7 | kJ/mol | Ccb | Roux, Jimenez, et al., 1998 | ALS |
Quantity | Value | Units | Method | Reference | Comment |
ΔcH°solid | -4680.4 ± 2.4 | kJ/mol | Ccb | Roux, Jimenez, et al., 1998 | Corresponding ΔfHºsolid = -683.9 kJ/mol (simple calculation by NIST; no Washburn corrections); ALS |
Constant pressure heat capacity of liquid
Cp,liquid (J/mol*K) | Temperature (K) | Reference | Comment |
---|---|---|---|
303.8 | 300. | Martynenko, Rabinovich, et al., 1970 | T = 60 to 360 K.; DH |

Phase change data

Data compiled as indicated in comments:
BS - Robert L. Brown and Stephen E. Stein
TRC - Thermodynamics Research Center, NIST Boulder Laboratories, Chris Muzny director
AC - William E. Acree, Jr., James S. Chickos
DRB - Donald R. Burgess, Jr.
DH - Eugene S. Domalski and Elizabeth D. Hearing
Quantity | Value | Units | Method | Reference | Comment |
---|---|---|---|---|---|
Tboil | 555.2 | K | N/A | Aldrich Chemical Company Inc., 1990 | BS |
Tboil | 555.5 | K | N/A | Buckingham and Donaghy, 1982 | BS |
Quantity | Value | Units | Method | Reference | Comment |
Tfus | 273. | K | N/A | Buckingham and Donaghy, 1982 | BS |
Tfus | 273.2 | K | N/A | Dozen, Fujishima, et al., 1978 | Uncertainty assigned by TRC = 0.2 K; TRC |
Quantity | Value | Units | Method | Reference | Comment |
Ttriple | 274.18 | K | N/A | Martynenko, Rabinovich, et al., 1970, 2 | Uncertainty assigned by TRC = 0.02 K; TRC |
Quantity | Value | Units | Method | Reference | Comment |
ΔsubH° | 77.7 | kJ/mol | N/A | Roux, Jimenez, et al., 1998 | DRB |
Reduced pressure boiling point
Tboil (K) | Pressure (bar) | Reference | Comment |
---|---|---|---|
389. to 389.6 | 0.003 | Buckingham and Donaghy, 1982 | BS |
Enthalpy of vaporization
ΔvapH (kJ/mol) | Temperature (K) | Method | Reference | Comment |
---|---|---|---|---|
61.5 | 481. | EB | Rohác, Musgrove, et al., 1999 | Based on data from 466. to 518. K.; AC |
69.4 ± 0.1 | 365. | C | Maksimuk, Kabo, et al., 1998 | AC |
72.5 ± 0.6 | 344. | C | Maksimuk, Kabo, et al., 1998 | AC |
74.5 ± 0.3 | 326. | C | Maksimuk, Kabo, et al., 1998 | AC |
78.7 | 319. | A | Stephenson and Malanowski, 1987 | Based on data from 304. to 371. K.; AC |
63.7 | 386. | A | Stephenson and Malanowski, 1987 | Based on data from 371. to 547. K.; AC |
68.6 | 409. | N/A | Davydova, Makolkin, et al., 1969 | Based on data from 377. to 440. K.; AC |
Enthalpy of fusion
ΔfusH (kJ/mol) | Temperature (K) | Reference | Comment |
---|---|---|---|
16.945 | 274.18 | Martynenko, Rabinovich, et al., 1970 | DH |
16.95 | 274.2 | Maksimuk, Kabo, et al., 1998 | AC |
16.95 | 274.2 | Acree, 1993 | AC |
Entropy of fusion
ΔfusS (J/mol*K) | Temperature (K) | Reference | Comment |
---|---|---|---|
61.8 | 274.18 | Martynenko, Rabinovich, et al., 1970 | DH |

Henry's Law data

Data compiled by: Rolf Sander
Henry's Law constant (water solution)
kH(T) = k°H exp(d(ln(kH))/d(1/T) ((1/T) - 1/(298.15 K)))
k°H = Henry's law constant for solubility in water at 298.15 K (mol/(kg*bar))
d(ln(kH))/d(1/T) = Temperature dependence constant (K)
k°H (mol/(kg*bar)) | d(ln(kH))/d(1/T) (K) | Method | Reference |
---|---|---|---|
3000. | 5700. | X | N/A |

Gas phase ion energetics data

Data compiled as indicated in comments:
RDSH - Henry M. Rosenstock, Keith Draxl, Bruce W. Steiner, and John T. Herron
B - John E. Bartmess
Electron affinity determinations
EA (eV) | Method | Reference | Comment |
---|---|---|---|
0.550032 | ECD | Kuhn, Levins, et al., 1968 | Done at constant temperature, accuracy uncertain: Chen and Wentworth, 1989;; B |
Ionization energy determinations
IE (eV) | Method | Reference | Comment |
---|---|---|---|
9.64 ± 0.07 | EI | Kuhn, Levins, et al., 1968 | RDSH |
Appearance energy determinations
Ion | AE (eV) | Other Products | Method | Reference | Comment |
---|---|---|---|---|---|
C6H4+ | 14.7 ± 0.2 | ? | EI | Grutzmacher and Lohmann, 1967 | RDSH |

Kovats' RI, non-polar column, isothermal

Column type | Active phase | Temperature (C) | I | Reference | Comment |
---|---|---|---|---|---|
Capillary | Ultra-1 | 125. | 1409. | Herrmann, Dufka, et al., 1986 | 25. m/0.20 mm/0.32 μm, N2 |
Capillary | Ultra-1 | 150. | 1418. | Herrmann, Dufka, et al., 1986 | 25. m/0.20 mm/0.32 μm, N2 |
Capillary | Ultra-1 | 175. | 1427. | Herrmann, Dufka, et al., 1986 | 25. m/0.20 mm/0.32 μm, N2 |
Capillary | Ultra-1 | 200. | 1437. | Herrmann, Dufka, et al., 1986 | 25. m/0.20 mm/0.32 μm, N2 |
Capillary | OV-101 | 230. | 1453. | Friocourt, Berthou, et al., 1979 | 50. m/0.3 mm/0.35 μm, N2 |
Packed | OV-101 | 150. | 1416. | Delley and Friedrich, 1977 | Gas Chrom Q (80-100 mesh) |
Packed | OV-1 | 150. | 1420. | Fedoreev and Maksimov, 1977 | Gaschrom; Column length: 1.5 m |
Packed | SE-30 | 220. | 1457. | Zulaïca and Guiochon, 1963 | Column length: 2. m |

Kovats' RI, non-polar column, temperature ramp

Column type | Active phase | I | Reference | Comment |
---|---|---|---|---|
Packed | OV-101 | 1435. | Alley and Dykes, 1972 | 6. K/min; Tstart: 70. C; Tend: 220. C |

Kovats' RI, non-polar column, custom temperature program

Column type | Active phase | I | Reference | Comment |
---|---|---|---|---|
Packed | SE-30 | 1434. | Ramsey, Lee, et al., 1980 | He, Chromosorb G HP (80-100 mesh); Column length: 1.5 m; Program: not specified |

Van Den Dool and Kratz RI, non-polar column, temperature ramp

Column type | Active phase | I | Reference | Comment |
---|---|---|---|---|
Capillary | VF-5MS | 1476. | Zheng, 2011 | 30. m/0.25 mm/0.25 μm, He; Tstart: 60. C; Tend: 270. C |
Capillary | DB-1 | 1400.0 | Sun and Stremple, 2003 | 30. m/0.25 mm/0.25 μm, He, 3. K/min; Tstart: 40. C; Tend: 325. C |
Capillary | DB-1 | 1457. | Johnson, Urso, et al., 1997 | 30. m/0.2 mm/0.25 μm, 50. C @ 2. min, 5. K/min, 300. C @ 5. min |
Capillary | 5 % Phenyl methyl siloxane | 1454. | Guisto, Smith, et al., 1993 | 25. m/0.31 mm/0.31 μm, 50. C @ 1. min, 5. K/min, 250. C @ 10. min |
Packed | SE-30 | 1400. | Helaimia and Messadi, 1989 | Chromosorb Q, 10. K/min; Column length: 2. m; Tstart: 100. C |
Packed | SE-30 | 1425. | Helaimia and Messadi, 1989 | Chromosorb Q, 10. K/min; Column length: 2. m; Tstart: 100. C |
Capillary | SP-2100 | 1429.29 | Podmaniczky, Szepesy, et al., 1986 | H2, 2. K/min; Tstart: 170. C |
Capillary | SP-2100 | 1431.47 | Podmaniczky, Szepesy, et al., 1986 | H2, 4. K/min; Tstart: 170. C |
Capillary | SP-2100 | 1429.44 | Podmaniczky, Szepesy, et al., 1986 | H2, 6. K/min; Tstart: 170. C |
Capillary | SP-2100 | 1440.94 | Podmaniczky, Szepesy, et al., 1986 | H2, 2. K/min; Tstart: 170. C |
Capillary | SP-2100 | 1441.55 | Podmaniczky, Szepesy, et al., 1986 | H2, 4. K/min; Tstart: 170. C |
Capillary | SP-2100 | 1433.14 | Podmaniczky, Szepesy, et al., 1986 | H2, 6. K/min; Tstart: 170. C |
Capillary | CP Sil 5 CB | 1431.25 | Podmaniczky, Szepesy, et al., 1986 | H2, 4. K/min; Tstart: 170. C |
Capillary | SE-54 | 1449. | Weber, 1986 | 25. m/0.31 mm/0.17 μm, H2, 2. K/min; Tstart: 35. C |
Capillary | SE-54 | 1457. | Weber, 1986 | 25. m/0.31 mm/0.17 μm, H2, 2. K/min; Tstart: 35. C |
Packed | SE-30 | 1425. | Messadi and Vergnaud, 1979 | N2, Chromosorb Q, 10. K/min; Tstart: 100. C; Tend: 340. C |

Van Den Dool and Kratz RI, non-polar column, custom temperature program

Column type | Active phase | I | Reference | Comment |
---|---|---|---|---|
Capillary | HP-5MS | 1466.2 | Andriamaharavo, 2014 | 30. m/0.25 mm/0.25 μm, He; Program: 60C (1 min) => 5 C/min => 210C => 10 C/min => 280C (15 min) |
Capillary | OV-101 | 1406. | Yasuhara, Shiraishi, et al., 1997 | 15. m/0.25 mm/0.25 μm, He; Program: 50C(2min) => (20C/min) => 120C => (7C/min) => 310C(10min) |
Capillary | 5 % Phenyl methyl siloxane | 1458. | Yasuhara, Shiraishi, et al., 1997 | 25. m/0.31 mm/0.52 μm, He; Program: 50C(2min) => (20C/min) => 120C => (7C/min) => 310C(10min) |

Van Den Dool and Kratz RI, polar column, temperature ramp

Column type | Active phase | I | Reference | Comment |
---|---|---|---|---|
Capillary | Supelcowax-10 | 2303. | Chung, Yung, et al., 2002 | 60. m/0.25 mm/0.25 μm, He, 35. C @ 5. min, 2. K/min, 195. C @ 90. min |
Capillary | Supelcowax-10 | 2303. | Chung, Yung, et al., 2001 | 60. m/0.25 mm/0.25 μm, He, 35. C @ 5. min, 2. K/min, 195. C @ 90. min |

Normal alkane RI, non-polar column, temperature ramp

Column type | Active phase | I | Reference | Comment |
---|---|---|---|---|
Capillary | DB-5 MS | 1454. | Su, Wang, et al., 2009 | 30. m/0.25 mm/0.25 μm, Helium, 40. C @ 2. min, 4. K/min, 250. C @ 2. min |
Capillary | HP-5 | 1460.7 | Leffingwell and Alford, 2005 | 60. m/0.32 mm/0.25 μm, He, 30. C @ 2. min, 2. K/min, 260. C @ 28. min |
Packed | SE-30 | 1417. | Lourici, Souici, et al., 1999 | Nitrogen, Chromosorb Q (60-80 mesh), 8. K/min; Column length: 2. m; Tstart: 100. C; Tend: 290. C |
Packed | SE-30 | 1417. | Lourici, Souici, et al., 1999 | Nitrogen, Chromosorb Q (60-80 mesh), 8. K/min; Column length: 2. m; Tstart: 100. C; Tend: 290. C |
Packed | SE-30 | 1417. | Lourici, Souici, et al., 1999 | Nitrogen, Chromosorb Q (60-80 mesh), 8. K/min; Column length: 2. m; Tstart: 100. C; Tend: 290. C |
Packed | SE-30 | 1417. | Lourici, Souici, et al., 1999 | Nitrogen, Chromosorb Q (60-80 mesh), 8. K/min; Column length: 2. m; Tstart: 100. C; Tend: 290. C |
Packed | SE-30 | 1417. | Lourici, Souici, et al., 1999 | Nitrogen, Chromosorb Q (60-80 mesh), 8. K/min; Column length: 2. m; Tstart: 100. C; Tend: 290. C |
Packed | SE-30 | 1418. | Lourici, Souici, et al., 1999 | Nitrogen, Chromosorb Q (60-80 mesh), 8. K/min; Column length: 2. m; Tstart: 100. C; Tend: 290. C |
Packed | SE-30 | 1426. | Lourici, Souici, et al., 1999 | Nitrogen, Chromosorb Q (60-80 mesh), 8. K/min; Column length: 2. m; Tstart: 100. C; Tend: 290. C |
Capillary | Ultra-1 | 1400. | Okumura, 1991 | 25. m/0.32 mm/0.25 μm, He, 3. K/min; Tstart: 80. C; Tend: 260. C |
Capillary | Ultra-1 | 1405. | Okumura, 1991 | 25. m/0.32 mm/0.25 μm, He, 3. K/min; Tstart: 80. C; Tend: 260. C |
Capillary | SE-54 | 1456. | Harland, Cumming, et al., 1986 | He, 50. C @ 2. min, 8. K/min, 250. C @ 12. min; Column length: 25. m; Column diameter: 0.32 mm |
Capillary | DB-1 | 1406. | Flath, Mon, et al., 1983 | 50. C @ 0.1 min, 4. K/min, 250. C @ 5. min; Column length: 60. m; Column diameter: 0.32 mm |
Capillary | OV-101 | 1414. | Pinkston, Spiteller, et al., 1981 | H2, 80. C @ 7. min, 2. K/min; Column length: 30. m; Column diameter: 0.3 mm; Tend: 275. C |
Capillary | OV-101 | 1414. | Spiteller and Spiteller, 1979 | He, 75. C @ 7. min, 2. K/min; Column length: 25. m; Tend: 280. C |
Capillary | OV-101 | 1481. | Spiteller and Spiteller, 1979 | He, 75. C @ 7. min, 2. K/min; Column length: 25. m; Tend: 280. C |

Normal alkane RI, non-polar column, custom temperature program

Column type | Active phase | I | Reference | Comment |
---|---|---|---|---|
Capillary | SLB-5 MS | 1445. | Mondello, 2012 | 30. m/0.25 mm/0.25 μm, Helium; Program: not specified |
Capillary | SLB-5 MS | 1451. | Mondello, 2012 | 30. m/0.25 mm/0.25 μm, Helium; Program: not specified |
Capillary | Siloxane, 5 % Ph | 1469. | VOC BinBase, 2012 | Program: not specified |
Capillary | Polydimethyl siloxane, 5 % phenyl | 1469. | Skogerson, Wohlgemuth, et al., 2011 | Program: not specified |
Capillary | DB-5 MS | 1460. | Su, Wang, et al., 2009 | 30. m/0.25 mm/0.25 μm, Helium; Program: not specified |
Capillary | HP-5 | 1456. | Zhao, Li, et al., 2008 | 30. m/0.25 mm/0.25 μm; Program: 40 0C (2 min) 5 0C/min -> 80 0C 7 oC/min -> 160 0C 9 0C/min -> 200 0C 20 0C/min -> 280 0C (10 min) |
Capillary | HP-5 | 1440. | Zhao, Li, et al., 2008 | 30. m/0.25 mm/0.25 μm; Program: not specified |
Capillary | Polydimethyl siloxanes | 1413. | Zenkevich, 2003 | Program: not specified |
Capillary | OV-1, SE-30, Methyl silicone, SP-2100, OV-101, DB-1, etc. | 1453. | Waggott and Davies, 1984 | Hydrogen; Column length: 50. m; Column diameter: 0.32 mm; Program: not specified |
Other | Methyl Silicone | 1406. | Ardrey and Moffat, 1981 | Program: not specified |

Normal alkane RI, polar column, temperature ramp

Column type | Active phase | I | Reference | Comment |
---|---|---|---|---|
Capillary | DB-Wax | 2276. | Cai, Lin, et al., 2006 | 60. m/0.25 mm/0.5 μm, He, 50. C @ 2. min, 3. K/min, 230. C @ 20. min |

Normal alkane RI, polar column, custom temperature program

Column type | Active phase | I | Reference | Comment |
---|---|---|---|---|
Capillary | DB-Wax | 2325. | Peng, Yang, et al., 1991 | Program: not specified |

Lee's RI, non-polar column, temperature ramp

Column type | Active phase | I | Reference | Comment |
---|---|---|---|---|
Capillary | DB-1 | 257.4 | Johnson, Urso, et al., 1997 | 30. m/0.2 mm/0.25 μm, 50. C @ 2. min, 5. K/min, 300. C @ 5. min |
Capillary | DB-5 | 248.0 | Donnelly, Abdel-Hamid, et al., 1993 | 30. m/0.32 mm/0.25 μm, He, 40. C @ 3. min, 8. K/min, 285. C @ 29.5 min |

References

Roux, Jimenez, et al., 1998
Roux, M.A.; Jimenez, P.; Davalos, J.Z.; Turrion, C.; Afeefy, H.Y.; Liebman, J.F.,
Enthalpies of formation of methyl benzenecarboxylates,
J. Chem. Soc. Faraday Trans., 1998, 94, 887-890. [all data]
Handrick, 1956
Handrick, G.R.,
Report of the study of pure explosive compounds. Part IV. Calculation of heat of combustion of organic compounds from structural features and calculation of power of high explosives, Rpt. C-58247 for the Office of the Chief of Ordnance, contract DA-19-020-ORD-47 by the Arthur D. Little, Inc., Cambridge, MA, 1956, 467-573. [all data]
Martynenko, Rabinovich, et al., 1970
Martynenko, L.Ya.; Rabinovich, I.B.; Ovchinnikov, Yu.V.; Maslova, V.A.,
Heat capacity of the systems polyvinyl chloride-dioctylphthalate and polyvinyl chloride-dibutylphthalate,
Polymer Sci., 1970, USSR 12A, 952-961. [all data]
Aldrich Chemical Company Inc., 1990
Aldrich Chemical Company Inc.,
Catalog Handbook of Fine Chemicals, Aldrich Chemical Company, Inc., Milwaukee WI, 1990, 1. [all data]
Buckingham and Donaghy, 1982
Buckingham, J.; Donaghy, S.M.,
Dictionary of Organic Compounds: Fifth Edition, Chapman and Hall, New York, 1982, 1. [all data]
Dozen, Fujishima, et al., 1978
Dozen, Y.; Fujishima, S.; Shingu, H.,
Structures and fusion parameters of methoxycarbonyl-benzenes and -naphthalenes,
Thermochim. Acta, 1978, 25, 2, 209, https://doi.org/10.1016/0040-6031(78)85008-4
. [all data]
Martynenko, Rabinovich, et al., 1970, 2
Martynenko, L.Ya.; Rabinovich, I.B.; Ovchinnikov, Yu.V.; Maslova, V.A.,
Heat capacity of the systems polyvinyl chloride-dioctylphthalate and polyvinyl chloride-dibutylphthalate,
Polym. Sci. USSR (Engl. Transl.), 1970, 12, 952. [all data]
Rohác, Musgrove, et al., 1999
Rohác, Vladislav; Musgrove, Jana E.; Ruzicka, Kvetoslav; Ruzicka, Vlastimil; Zábranský, Milan; Aim, Karel,
Thermodynamic properties of dimethyl phthalate along the (vapour + liquid) saturation curve,
The Journal of Chemical Thermodynamics, 1999, 31, 8, 971-986, https://doi.org/10.1006/jcht.1999.0494
. [all data]
Maksimuk, Kabo, et al., 1998
Maksimuk, Yury V.; Kabo, Gennady J.; Simirsky, Vladimir V.; Kozyro, Alexander A.; Sevruk, Victor M.,
Standard Enthalpies of Formation of Some Methyl Esters of Benzene Carboxylic Acids,
J. Chem. Eng. Data, 1998, 43, 3, 293-298, https://doi.org/10.1021/je970116j
. [all data]
Stephenson and Malanowski, 1987
Stephenson, Richard M.; Malanowski, Stanislaw,
Handbook of the Thermodynamics of Organic Compounds, 1987, https://doi.org/10.1007/978-94-009-3173-2
. [all data]
Davydova, Makolkin, et al., 1969
Davydova, Zh.V.; Makolkin, I.A.; Bataev, P.S.,
Zh. Obshch. Khim., 1969, 39, 8, 1668. [all data]
Acree, 1993
Acree, William E.,
Thermodynamic properties of organic compounds,
Thermochimica Acta, 1993, 219, 97-104, https://doi.org/10.1016/0040-6031(93)80486-T
. [all data]
Kuhn, Levins, et al., 1968
Kuhn, W.F.; Levins, R.J.; Lilly, A.C., Jr.,
Electron affinities and ionization potentials of phthalate compounds,
J. Chem. Phys., 1968, 49, 5550. [all data]
Chen and Wentworth, 1989
Chen, E.C.M.; Wentworth, W.E.,
Experimental Determination of Electron Affinities of Organic Molecules,
Mol. Cryst. Liq. Cryst., 1989, 171, 271. [all data]
Grutzmacher and Lohmann, 1967
Grutzmacher, H.-F.; Lohmann, J.,
Massenspektrometrie instabiler organischer Molekule. I. Ionisations-potential und Bildungsenthalpie von Dehydrobenzol,
Ann. Chem., 1967, 705, 81. [all data]