1,2-Methanodicyclopropa[cd,gh]pentalene,octahydro-
- Formula: C9H10
- Molecular weight: 118.1757
- IUPAC Standard InChIKey: WEDSMIBYBDZOFA-UHFFFAOYSA-N
- CAS Registry Number: 13084-56-5
- Chemical structure:
View 3d structure (requires JavaScript / HTML 5) - Permanent link for this species. Use this link for bookmarking this species for future reference.

Gas phase ion energetics data

Data compiled by: Sharon G. Lias, Rhoda D. Levin, and Sherif A. Kafafi
Ionization energy determinations
IE (eV) | Method | Reference | Comment |
---|---|---|---|
9.15 ± 0.05 | PE | Martin, Heller, et al., 1977 | Vertical value |
9.06 ± 0.02 | PE | Martin, Heller, et al., 1974 | Vertical value |

References

Martin, Heller, et al., 1977
Martin, H.-D.; Heller, C.; Haider, R.; Hoffmann, R.W.; Becherer, J.; Kurz, H.R.,
Vertikale oder nicht-vertikale stabilisierung im Pentacyclo- [4.3.0.02,4.03,8.05,7]non-9-yl-Kation? Das 9-methylenpentacyclononan-radikalkation,
Chem. Ber., 1977, 110, 3010. [all data]
Martin, Heller, et al., 1974
Martin, H.-D.; Heller, C.; Werp, J.,
Bishomofulvenkonjugation. Photoelektronenspektren und elektronenstruktur homologer quadricyclane,
Chem. Ber., 1974, 107, 1393. [all data]