Bicyclo[2.2.1]hept-5-en-2-ol
- Formula: C7H10O
- Molecular weight: 110.1537
- IUPAC Standard InChIKey: MKOSBHNWXFSHSW-UHFFFAOYSA-N
- CAS Registry Number: 13080-90-5
- Chemical structure:
View 3d structure (requires JavaScript / HTML 5) - Other names: 5-Norbornene-2-ol; 5-Norbornen-2-ol

Gas phase ion energetics data

Data compiled by: Sharon G. Lias, John E. Bartmess, Joel F. Liebman, John L. Holmes, Rhoda D. Levin, and W. Gary Mallard
Appearance energy determinations
Ion | AE (eV) | Other Products | Method | Reference | Comment |
---|---|---|---|---|---|
C5H6+ | 9.37 ± 0.05 | CH2=CHOH | EI | Turecek and Havlas, 1986 |

References

Turecek and Havlas, 1986
Turecek, F.; Havlas, Z.,
Energy barriers to the diels-alder cycloadditions and cycloreversions of cation-radicals in the gas phase,
J. Chem. Soc. Perkin Trans. 2, 1986, 1011. [all data]