Ethylidene,diazo
- Formula: C2N2
- Molecular weight: 52.0348
- IUPAC Standard InChIKey: IPMSOMKMGJLNBC-UHFFFAOYSA-N
- CAS Registry Number: 130760-10-0
- Chemical structure:
View 3d structure (requires JavaScript / HTML 5) - Information on this page:

Gas phase ion energetics data

Data compiled by: Henry M. Rosenstock, Keith Draxl, Bruce W. Steiner, and John T. Herron
Appearance energy determinations
Ion | AE (eV) | Other Products | Method | Reference | Comment |
---|---|---|---|---|---|
C2+ | 18.4 ± 0.3 | N2 | EI | Dibeler, Reese, et al., 1961 |

References

Dibeler, Reese, et al., 1961
Dibeler, V.H.; Reese, R.M.; Franklin, J.L.,
Mass spectrometric study of cyanogen and cyanoacetylenes,
J. Am. Chem. Soc., 1961, 83, 1813. [all data]