calcium dihydroxide
- Formula: CaH2O2
- Molecular weight: 74.093
- CAS Registry Number: 1305-62-0

Gas phase thermochemistry data

Quantity | Value | Units | Method | Reference | Comment |
---|---|---|---|---|---|
ΔfH°gas | -610.76 | kJ/mol | Review | Chase, 1998 | Data last reviewed in December, 1975 |
Quantity | Value | Units | Method | Reference | Comment |
S°gas,1 bar | 285.62 | J/mol*K | Review | Chase, 1998 | Data last reviewed in December, 1975 |
Gas Phase Heat Capacity (Shomate Equation)
Cp° = A + B*t + C*t2 + D*t3 +
E/t2
H° − H°298.15= A*t + B*t2/2 +
C*t3/3 + D*t4/4 − E/t + F − H
S° = A*ln(t) + B*t + C*t2/2 + D*t3/3 −
E/(2*t2) + G
Cp = heat capacity (J/mol*K)
H° = standard enthalpy (kJ/mol)
S° = standard entropy (J/mol*K)
t = temperature (K) / 1000.
View plot Requires a JavaScript / HTML 5 canvas capable browser.
Temperature (K) | 298. to 6000. |
---|---|
A | 81.10307 |
B | 15.01922 |
C | -3.059065 |
D | 0.213893 |
E | -1.042102 |
F | -639.0893 |
G | 373.5601 |
H | -610.7636 |
Reference | Chase, 1998 |
Comment | Data last reviewed in December, 1975 |

Condensed phase thermochemistry data

Quantity | Value | Units | Method | Reference | Comment |
---|---|---|---|---|---|
ΔfH°solid | -986.09 | kJ/mol | Review | Chase, 1998 | Data last reviewed in December, 1975 |
Quantity | Value | Units | Method | Reference | Comment |
S°solid | 83.36 | J/mol*K | Review | Chase, 1998 | Data last reviewed in December, 1975 |
Solid Phase Heat Capacity (Shomate Equation)
Cp° = A + B*t + C*t2 + D*t3 +
E/t2
H° − H°298.15= A*t + B*t2/2 +
C*t3/3 + D*t4/4 − E/t + F − H
S° = A*ln(t) + B*t + C*t2/2 + D*t3/3 −
E/(2*t2) + G
Cp = heat capacity (J/mol*K)
H° = standard enthalpy (kJ/mol)
S° = standard entropy (J/mol*K)
t = temperature (K) / 1000.
View plot Requires a JavaScript / HTML 5 canvas capable browser.
Temperature (K) | 298. to 1000. |
---|---|
A | 130.8253 |
B | -82.69216 |
C | 122.7690 |
D | -50.39210 |
E | -2.513146 |
F | -1030.841 |
G | 247.1857 |
H | -986.0851 |
Reference | Chase, 1998 |
Comment | Data last reviewed in December, 1975 |

Reaction thermochemistry data

Data compiled by: Hussein Y. Afeefy, Joel F. Liebman, and Stephen E. Stein
Individual Reactions
H2CaO2 + 2 = CaCl2 + 2
+ 2
By formula: H2CaO2 + 2C2HCl5 = CaCl2 + 2C2Cl4 + 2H2O
Quantity | Value | Units | Method | Reference | Comment |
---|---|---|---|---|---|
ΔrH° | -181.6 | kJ/mol | Cm | Kirkbride, 1956 | liquid phase |
H2CaO2 + 2 = CaCl2 + 2
+ 2
By formula: H2CaO2 + 2C2H2Cl4 = CaCl2 + 2H2O + 2C2HCl3
Quantity | Value | Units | Method | Reference | Comment |
---|---|---|---|---|---|
ΔrH° | -150. | kJ/mol | Cm | Kirkbride, 1956 | liquid phase |

Gas phase ion energetics data

Data compiled by: Sharon G. Lias, John E. Bartmess, Joel F. Liebman, John L. Holmes, Rhoda D. Levin, and W. Gary Mallard
Ionization energy determinations
IE (eV) | Method | Reference |
---|---|---|
9. ± 1. | EI | Farber, Srivastava, et al., 1987 |

Vibrational and/or electronic energy levels

Data compiled by: Marilyn E. Jacox
State: X
Vib. sym. |
No. | Approximate type of mode |
cm-1 | Med. | Method | References | |
---|---|---|---|---|---|---|---|
OH stretch | 3782 | Ne | IR | Wang and Andrews, 2005 | |||
OH stretch | 3784.6 | Ar | IR | Andrews and Wang, 2005 Wang and Andrews, 2005 | |||
OH stretch | 3776.1 | H2 | IR | Wang and Andrews, 2005 | |||
OH stretch | 3771.3 | H2 | IR | Wang and Andrews, 2005 | |||
CaO a-stretch | 606.7 | Ne | IR | Wang and Andrews, 2005 | |||
CaO a-stretch | 592.4 | Ar | IR | Kauffman, Hauge, et al., 1984 Andrews and Wang, 2005 Wang and Andrews, 2005 | |||
CaO a-stretch | 578.2 | H2 | IR | Wang and Andrews, 2005 | |||
Additional references: Jacox, 1994, page 251

References

Chase, 1998
Chase, M.W., Jr.,
NIST-JANAF Themochemical Tables, Fourth Edition,
J. Phys. Chem. Ref. Data, Monograph 9, 1998, 1-1951. [all data]
Kirkbride, 1956
Kirkbride, F.W.,
The heats of chlorination of some hydrocarbons and their chloro-derivatives,
J. Appl. Chem., 1956, 6, 11-21. [all data]
Farber, Srivastava, et al., 1987
Farber, M.; Srivastava, R.D.; Moyer, J.W.; Leeper, J.D.,
Effusion mass spectrometric determination of thermodynamic properties of the gaseous mono- and di-hydroxides of calcium and KCaO(g),
J. Chem. Soc. Faraday Trans. 2, 1987, 83, 3229. [all data]