Cyclopentanol,2-methoxy-,cis-
- Formula: C6H12O2
- Molecular weight: 116.1583
- IUPAC Standard InChIKey: YVXLDOASGKIXII-NTSWFWBYSA-N
- CAS Registry Number: 13051-91-7
- Chemical structure:
View 3d structure (requires JavaScript / HTML 5) - Stereoisomers:

Gas phase ion energetics data

Data compiled by: Sharon G. Lias, Rhoda D. Levin, and Sherif A. Kafafi
Ionization energy determinations
IE (eV) | Method | Reference | Comment |
---|---|---|---|
9.80 | PE | Brown, 1976 | Vertical value |

References

Brown, 1976
Brown, R.S.,
Application of photoelectron spectroscopy to intramolecularly hydrogen-bonded systems. Part III. The photoelectron spectra of cis and trans 2-substituted cyclopentanols cis and trans 2-substituted cyclohexanols,
Can. J. Chem., 1976, 54, 1929. [all data]