diboron trioxide
- Formula: B2O3
- Molecular weight: 69.620
- CAS Registry Number: 1303-86-2

Condensed phase thermochemistry data

Quantity | Value | Units | Method | Reference | Comment |
---|---|---|---|---|---|
ΔfH°liquid | -1253.36 | kJ/mol | Review | Chase, 1998 | Data last reviewed in June, 1971 |
Quantity | Value | Units | Method | Reference | Comment |
S°liquid,1 bar | 78.45 | J/mol*K | Review | Chase, 1998 | Data last reviewed in June, 1971 |
Quantity | Value | Units | Method | Reference | Comment |
ΔfH°solid | -1273.5 ± 1.4 | kJ/mol | Review | Cox, Wagman, et al., 1984 | CODATA Review value |
ΔfH°solid | -1271.94 | kJ/mol | Review | Chase, 1998 | Data last reviewed in June, 1971 |
Quantity | Value | Units | Method | Reference | Comment |
S°solid,1 bar | 53.97 ± 0.30 | J/mol*K | Review | Cox, Wagman, et al., 1984 | CODATA Review value |
Quantity | Value | Units | Method | Reference | Comment |
S°solid | 53.95 | J/mol*K | Review | Chase, 1998 | Data last reviewed in June, 1971 |
Liquid Phase Heat Capacity (Shomate Equation)
Cp° = A + B*t + C*t2 + D*t3 +
E/t2
H° − H°298.15= A*t + B*t2/2 +
C*t3/3 + D*t4/4 − E/t + F − H
S° = A*ln(t) + B*t + C*t2/2 + D*t3/3 −
E/(2*t2) + G
Cp = heat capacity (J/mol*K)
H° = standard enthalpy (kJ/mol)
S° = standard entropy (J/mol*K)
t = temperature (K) / 1000.
View plot Requires a JavaScript / HTML 5 canvas capable browser.
Temperature (K) | 723. to 3000. |
---|---|
A | 111.5690 |
B | 23.17410 |
C | -10.32210 |
D | 1.533191 |
E | 3.539531 |
F | -1290.900 |
G | 188.0810 |
H | -1253.360 |
Reference | Chase, 1998 |
Comment | Data last reviewed in June, 1971 |
Solid Phase Heat Capacity (Shomate Equation)
Cp° = A + B*t + C*t2 + D*t3 +
E/t2
H° − H°298.15= A*t + B*t2/2 +
C*t3/3 + D*t4/4 − E/t + F − H
S° = A*ln(t) + B*t + C*t2/2 + D*t3/3 −
E/(2*t2) + G
Cp = heat capacity (J/mol*K)
H° = standard enthalpy (kJ/mol)
S° = standard entropy (J/mol*K)
t = temperature (K) / 1000.
View plot Requires a JavaScript / HTML 5 canvas capable browser.
Temperature (K) | 298. to 723. |
---|---|
A | 5.431501 |
B | 272.5617 |
C | -252.4956 |
D | 97.65540 |
E | -0.377274 |
F | -1284.902 |
G | -12.50564 |
H | -1271.936 |
Reference | Chase, 1998 |
Comment | Data last reviewed in June, 1971 |

Gas phase ion energetics data

Data evaluated as indicated in comments:
L - Sharon G. Lias
Data compiled as indicated in comments:
LL - Sharon G. Lias and Joel F. Liebman
LLK - Sharon G. Lias, Rhoda D. Levin, and Sherif A. Kafafi
RDSH - Henry M. Rosenstock, Keith Draxl, Bruce W. Steiner, and John T. Herron
Quantity | Value | Units | Method | Reference | Comment |
---|---|---|---|---|---|
IE (evaluated) | 13.5 ± 0.2 | eV | N/A | N/A | L |
Ionization energy determinations
IE (eV) | Method | Reference | Comment |
---|---|---|---|
13.3 ± 0.5 | EI | Asano and Kou, 1988 | LL |
13.5 ± 0.15 | EI | Bagarat'yan and Nikitin, 1979 | LLK |
14. ± 0.5 | EI | Blackburn, Buchler, et al., 1966 | RDSH |
13.7 | EI | White, Sommer, et al., 1963 | RDSH |
Appearance energy determinations
Ion | AE (eV) | Other Products | Method | Reference | Comment |
---|---|---|---|---|---|
B+ | 13.90 ± 0.18 | BO3 | EI | Bagarat'yan and Nikitin, 1979 | LLK |
BO+ | 19.8 ± 0.26 | BO2 | EI | Bagarat'yan and Nikitin, 1979 | LLK |
BO2+ | 13.0 ± 0.5 | BO | EI | Asano and Kou, 1988 | LL |
BO2+ | 18.35 ± 0.36 | BO | EI | Bagarat'yan and Nikitin, 1979 | LLK |

References

Chase, 1998
Chase, M.W., Jr.,
NIST-JANAF Themochemical Tables, Fourth Edition,
J. Phys. Chem. Ref. Data, Monograph 9, 1998, 1-1951. [all data]
Cox, Wagman, et al., 1984
Cox, J.D.; Wagman, D.D.; Medvedev, V.A.,
CODATA Key Values for Thermodynamics, Hemisphere Publishing Corp., New York, 1984, 1. [all data]
Asano and Kou, 1988
Asano, M.; Kou, T.,
Thermochemical properties of SrBO2(g) and SrB2O4(s),
J. Chem. Thermodyn., 1988, 20, 1149. [all data]
Bagarat'yan and Nikitin, 1979
Bagarat'yan, N.V.; Nikitin, O.T.,
Electron ionization of vapor over boron oxide,
Vestn. Mosk. Univ. Khim., 1979, 34, 539. [all data]
Blackburn, Buchler, et al., 1966
Blackburn, P.E.; Buchler, A.; Stauffer, J.L.,
Thermodynamics of vaporization in the aluminum oxideboron oxide system,
J. Phys. Chem., 1966, 70, 2469. [all data]
White, Sommer, et al., 1963
White, D.; Sommer, A.; Walsh, P.N.; Goldstein, H.W.,
The application of the time-of-flight mass spectrometer to the study of inoganic materials at elevated temperatures,
Advan. Mass Spectrom., 1963, 2, 110. [all data]