1-Methylthio-3-buten-1-yne
- Formula: C5H6S
- Molecular weight: 98.166
- IUPAC Standard InChIKey: HIWIEVWZTYIZRX-UHFFFAOYSA-N
- CAS Registry Number: 13030-50-7
- Chemical structure:
View 3d structure (requires JavaScript / HTML 5) - Permanent link for this species. Use this link for bookmarking this species for future reference.

Gas phase ion energetics data

Data compiled by: Henry M. Rosenstock, Keith Draxl, Bruce W. Steiner, and John T. Herron
Appearance energy determinations
Ion | AE (eV) | Other Products | Method | Reference | Comment |
---|---|---|---|---|---|
CHS+ | 14.9 ± 0.3 | ? | EI | Bogolyubov, Plotnikov, et al., 1969 | |
C3HS+ | 17.4 ± 0.3 | ? | EI | Bogolyubov, Plotnikov, et al., 1969 | |
C3H3+ | 13.4 ± 0.3 | ? | EI | Bogolyubov, Plotnikov, et al., 1969 | |
C4HS+ | 19.0 ± 0.3 | ? | EI | Bogolyubov, Plotnikov, et al., 1969 | |
C4H2+ | 19.3 ± 0.3 | ? | EI | Bogolyubov, Plotnikov, et al., 1969 | |
C4H2S+ | 16.1 ± 0.3 | ? | EI | Bogolyubov, Plotnikov, et al., 1969 | |
C4H3+ | 15.6 ± 0.3 | ? | EI | Bogolyubov, Plotnikov, et al., 1969 | |
C4H3S+ | 11.6 ± 0.3 | CH3 | EI | Bogolyubov, Plotnikov, et al., 1969 | |
C4H5+ | 14.0 ± 0.3 | ? | EI | Bogolyubov, Plotnikov, et al., 1969 | |
C5H5S+ | 10.8 ± 0.3 | H | EI | Bogolyubov, Plotnikov, et al., 1969 |

References

Bogolyubov, Plotnikov, et al., 1969
Bogolyubov, G.M.; Plotnikov, V.F.; Boiko, Yu.A.; Petrov, A.A.,
Organic derivatives of elements of groups V and VI. IX. Mass spectra of vinylacetylene sulfides,
Zh. Obshch. Khim., 1969, 39, 2467, In original 2407. [all data]