1,1'-Biphenyl, 2,2'-dibromo-
- Formula: C12H8Br2
- Molecular weight: 312.000
- IUPAC Standard InChIKey: DRKHIWKXLZCAKP-UHFFFAOYSA-N
- CAS Registry Number: 13029-09-9
- Chemical structure:
View 3d structure (requires JavaScript / HTML 5) - Other names: Biphenyl, 2,2'-dibromo-; O,O'-Dibromobiphenyl; 2,2'-Dibromobiphenyl

Gas phase ion energetics data

Data compiled by: Sharon G. Lias, Rhoda D. Levin, and Sherif A. Kafafi
Ionization energy determinations
IE (eV) | Method | Reference |
---|---|---|
8.40 ± 0.02 | PE | Maier and Turner, 1972 |

References

Maier and Turner, 1972
Maier, J.P.; Turner, D.W.,
Steric inhibition of resonance studied by molecular photoelectron spectroscopy. Part I. Biphenyls,
Faraday Discuss. Chem. Soc., 1972, 54, 149. [all data]