dialuminium trisulphide
- Formula: Al2S3
- Molecular weight: 150.158
- CAS Registry Number: 1302-81-4

Condensed phase thermochemistry data

Quantity | Value | Units | Method | Reference | Comment |
---|---|---|---|---|---|
ΔfH°solid | -651.03 | kJ/mol | Review | Chase, 1998 | Data last reviewed in December, 1979 |
Quantity | Value | Units | Method | Reference | Comment |
S°solid | 116.84 | J/mol*K | Review | Chase, 1998 | Data last reviewed in December, 1979 |
Solid Phase Heat Capacity (Shomate Equation)
Cp° = A + B*t + C*t2 + D*t3 +
E/t2
H° − H°298.15= A*t + B*t2/2 +
C*t3/3 + D*t4/4 − E/t + F − H
S° = A*ln(t) + B*t + C*t2/2 + D*t3/3 −
E/(2*t2) + G
Cp = heat capacity (J/mol*K)
H° = standard enthalpy (kJ/mol)
S° = standard entropy (J/mol*K)
t = temperature (K) / 1000.
View plot Requires a JavaScript / HTML 5 canvas capable browser.
Temperature (K) | 298. to 1500. |
---|---|
A | 119.9243 |
B | 8.972254 |
C | 13.61147 |
D | -6.835233 |
E | -1.651635 |
F | -692.8369 |
G | 249.4551 |
H | -651.0304 |
Reference | Chase, 1998 |
Comment | Data last reviewed in December, 1979 |

Gas phase ion energetics data

Data compiled by: John E. Bartmess
Electron affinity determinations
EA (eV) | Method | Reference | Comment |
---|---|---|---|
>3.48999 | LPES | Nakajima, Zhang, et al., 1995 |

Vibrational and/or electronic energy levels

Data compiled by: Marilyn E. Jacox
State: X
Vib. sym. |
No. | Approximate type of mode |
cm-1 | Med. | Method | References | |
---|---|---|---|---|---|---|---|
687 | Ar | IR | Ault, 1994 | ||||
672 | Ar | IR | Ault, 1994 | ||||
445 | Ar | IR | Ault, 1994 | ||||
347 | Ar | IR | Ault, 1994 | ||||
Additional references: Jacox, 1998, page 297

References

Chase, 1998
Chase, M.W., Jr.,
NIST-JANAF Themochemical Tables, Fourth Edition,
J. Phys. Chem. Ref. Data, Monograph 9, 1998, 1-1951. [all data]
Nakajima, Zhang, et al., 1995
Nakajima, A.; Zhang, N.; Kawamata, H.; Hayase, T.; Nakao, K.; Kaya, K.,
Photoelectron spectroscopy and mass distributions of aluminum-sulfur cluster anions (AlnSm-),
Chem. Phys. Lett., 1995, 241, 4, 295, https://doi.org/10.1016/0009-2614(95)00653-L
. [all data]
Ault, 1994
Ault, B.S.,
Matrix isolation study of the reaction of trimethylaluminum with hydrogen sulfide and mercaptans: synthesis and spectra of molecular aluminum sulfide,
J. Phys. Chem., 1994, 98, 1, 77, https://doi.org/10.1021/j100052a014
. [all data]
Jacox, 1998
Jacox, M.E.,
Vibrational and electronic energy levels of polyatomic transient molecules: supplement A,
J. Phys. Chem. Ref. Data, 1998, 27, 2, 115-393, https://doi.org/10.1063/1.556017
. [all data]