Benzenamine, 4-(2-phenylethyl)-
- Formula: C14H15N
- Molecular weight: 197.2756
- IUPAC Standard InChIKey: ZRPMISJEZSOSQC-UHFFFAOYSA-N
- CAS Registry Number: 13024-49-2
- Chemical structure:
View 3d structure (requires JavaScript / HTML 5) - Other names: Aniline, p-phenethyl-; p-Phenethylaniline; 4-Aminodibenzyl

Gas phase ion energetics data

Data compiled as indicated in comments:
LLK - Sharon G. Lias, Rhoda D. Levin, and Sherif A. Kafafi
RDSH - Henry M. Rosenstock, Keith Draxl, Bruce W. Steiner, and John T. Herron
Ionization energy determinations
IE (eV) | Method | Reference | Comment |
---|---|---|---|
7.55 ± 0.05 | EI | Pignataro, Mancini, et al., 1972 | LLK |
Appearance energy determinations
Ion | AE (eV) | Other Products | Method | Reference | Comment |
---|---|---|---|---|---|
C7H7+ | ~15. | ? | EI | McLafferty, Wachs, et al., 1970 | RDSH |
C7H8N+ | 9.1 ± 0.2 | ? | EI | McLafferty, Wachs, et al., 1970 | RDSH |

References

Pignataro, Mancini, et al., 1972
Pignataro, S.; Mancini, V.; Innorta, G.; Distefano, G.,
Ionization energies and ring orbital interaction in diarylmethanes and diaryleth,
Z. Naturforsch., 1972, 27, 534. [all data]
McLafferty, Wachs, et al., 1970
McLafferty, F.W.; Wachs, T.; Lifshitz, C.; Innorta, G.; Irving, P.,
Substituent effects in unimolecular ion decompositions. XV. Mechanistic interpretations and the quasi-equilibrium theory,
J. Am. Chem. Soc., 1970, 92, 6867. [all data]