Chromium hexacarbonyl
- Formula: C6CrO6
- Molecular weight: 220.0567
- IUPAC Standard InChIKey: KOTQLLUQLXWWDK-UHFFFAOYSA-N
- CAS Registry Number: 13007-92-6
- Chemical structure:
View 3d structure (requires JavaScript / HTML 5) - Other names: Chromium carbonyl; Chromcarbonyl; Chromium carbonyl (cr(co)6), (oc-6-11)-; Chromium carbonyl (Cr(CO)6); Hexacarbonylchromium; Cr(CO)6

Gas phase thermochemistry data

Data compiled by: José A. Martinho Simões
Quantity | Value | Units | Method | Reference | Comment |
---|---|---|---|---|---|
ΔfH°gas | -910. ± 80. | kJ/mol | AVG | N/A | Average of 9 values; Individual data points |

Condensed phase thermochemistry data

Data compiled by: José A. Martinho Simões
Quantity | Value | Units | Method | Reference | Comment |
---|---|---|---|---|---|
ΔfH°solid | -980. ± 80. | kJ/mol | AVG | N/A | Average of 9 values; Individual data points |
Quantity | Value | Units | Method | Reference | Comment |
ΔcH°solid | -1932. ± 17. | kJ/mol | CC-SB | Pittam, Pilcher, et al., 1975 | Please also see Pedley and Rylance, 1977 and Tel'noi and Rabinovich, 1977. |
ΔcH°solid | -1949.4 ± 1.8 | kJ/mol | CC-SB | Shuman, Chernova, et al., 1974 | Please also see Pedley and Rylance, 1977 and Tel'noi and Rabinovich, 1977. |
ΔcH°solid | -1853.9 ± 4.2 | kJ/mol | CC-SB | Cotton, Fischer, et al., 1956 | Please also see Pedley and Rylance, 1977, Cox and Pilcher, 1970, and Tel'noi and Rabinovich, 1977. |

Phase change data

Data compiled as indicated in comments:
AC - William E. Acree, Jr., James S. Chickos
MS - José A. Martinho Simões
Quantity | Value | Units | Method | Reference | Comment |
---|---|---|---|---|---|
ΔsubH° | 69. ± 2. | kJ/mol | N/A | Al-Takhin, Connor, et al., 1984 | AC |
ΔsubH° | 72.0 ± 4.2 | kJ/mol | N/A | Pilcher and Skinner, 1983 | See also Pittam, Pilcher, et al., 1975, 2.; AC |
ΔsubH° | 70. ± 2. | kJ/mol | C | Ribeiro Da Silva and Reis, 1983 | AC |
ΔsubH° | 71.6 ± 1.7 | kJ/mol | CC-SB | Daamen, Ernsting, et al., 1979 | Please also see Boxhoorn, Ernsting, et al., 1980. Other values for the enthalpy of sublimation have been reported: 72.0 ± 4.2 kJ/mol Hieber and Romberg, 1935 Pilcher, Ware, et al., 1975, 69. ± 2. kJ/mol Al-Takhin, Connor, et al., 1984, 2 and 69.5 ± 4.2 kJ/mol Rezukhina and Shvyrev, 1952; MS |
ΔsubH° | 69.5 | kJ/mol | C | Adedeji, Lalage, et al., 1975 | AC |
Enthalpy of vaporization
ΔvapH (kJ/mol) | Temperature (K) | Reference | Comment |
---|---|---|---|
62.5 | 324. | Stull, 1947 | Based on data from 309. to 424. K.; AC |
Antoine Equation Parameters
log10(P) = A − (B / (T + C))
P = vapor pressure (bar)
T = temperature (K)
View plot Requires a JavaScript / HTML 5 canvas capable browser.
Temperature (K) | A | B | C | Reference | Comment |
---|---|---|---|---|---|
309. to 424. | 7.88118 | 3391.743 | 6.153 | Stull, 1947 | Coefficents calculated by NIST from author's data. |
Enthalpy of sublimation
ΔsubH (kJ/mol) | Temperature (K) | Method | Reference | Comment |
---|---|---|---|---|
63.3 | 328. | GS | Pankajavalli, Mallika, et al., 2002 | Based on data from 309. to 347. K.; AC |
65.7 | 269. | TE | Garner, Chandra, et al., 1995 | Based on data from 266. to 272. K.; AC |
68.5 ± 1.1 | 323. to 391. | N/A | Baev, 1993 | AC |
68.5 | 355.5 | A | Stephenson and Malanowski, 1987 | Based on data from 288. to 423. K.; AC |
71.6 ± 1.7 | 260. | ME | Boxhoorn, Ernsting, et al., 1980, 2 | Based on data from 240. to 280. K. See also Daamen, Ernsting, et al., 1979, 2.; AC |
71.5 ± 0.8 | 288. | BG | Boni, 1966 | Based on data from 274. to 301. K.; AC |
69.3 | 319. to 411. | N/A | Rezukhina and Shvyrev, 1952 | AC |
63.6 | 358. | MM | Windsor and Blanchard, 1934 | Based on data from 308. to 408. K.; AC |

Gas phase ion energetics data

Data evaluated as indicated in comments:
HL - Edward P. Hunter and Sharon G. Lias
Data compiled as indicated in comments:
LBLHLM - Sharon G. Lias, John E. Bartmess, Joel F. Liebman, John L. Holmes, Rhoda D. Levin, and W. Gary Mallard
LLK - Sharon G. Lias, Rhoda D. Levin, and Sherif A. Kafafi
RDSH - Henry M. Rosenstock, Keith Draxl, Bruce W. Steiner, and John T. Herron
Quantity | Value | Units | Method | Reference | Comment |
---|---|---|---|---|---|
Proton affinity (review) | 739.2 | kJ/mol | N/A | Hunter and Lias, 1998 | HL |
Quantity | Value | Units | Method | Reference | Comment |
Gas basicity | 714.6 | kJ/mol | N/A | Hunter and Lias, 1998 | HL |
Ionization energy determinations
IE (eV) | Method | Reference | Comment |
---|---|---|---|
8.2 | PE | Cooper, Green, et al., 1987 | LBLHLM |
8.24 ± 0.07 | PIPECO | Das, Nishimura, et al., 1985 | LBLHLM |
8.1 | PE | Hubbard and Lichtenberger, 1982 | LBLHLM |
8.42 ± 0.03 | EI | Michels, Flesch, et al., 1980 | LLK |
8.30 ± 0.05 | EI | Paetzold and Abd-el-Mottaleb, 1975 | LLK |
8.20 | EI | Muller, Fenderl, et al., 1971 | LLK |
8.2 ± 0.1 | EI | Fischer, Kreiter, et al., 1971 | LLK |
8.142 ± 0.017 | PI | Lloyd and Schlag, 1969 | RDSH |
8.40 | PE | Hubbard and Lichtenberger, 1982 | Vertical value; LBLHLM |
8.40 | PE | English, Plowman, et al., 1979 | Vertical value; LLK |
8.41 | PE | Block and Fenske, 1977 | Vertical value; LLK |
8.40 | PE | Head, Nixon, et al., 1975 | Vertical value; LLK |
8.40 ± 0.02 | PE | Higginson, Lloyd, et al., 1973 | Vertical value; LLK |
8.40 | PE | Caulton and Fenske, 1968 | Vertical value; Unpublished result of W.C. Price; RDSH |
Appearance energy determinations

Reaction thermochemistry data

Data compiled by: José A. Martinho Simões
Individual Reactions
(solution) +
(solution) = C12H16CrO5 (solution) +
(solution)
By formula: C6CrO6 (solution) + C7H16 (solution) = C12H16CrO5 (solution) + CO (solution)
Quantity | Value | Units | Method | Reference | Comment |
---|---|---|---|---|---|
ΔrH° | 27.1 ± 0.8 | kcal/mol | AVG | N/A | Average of 13 values; Individual data points |
(solution) = C5CrO5 (solution) +
(solution)
By formula: C6CrO6 (solution) = C5CrO5 (solution) + CO (solution)
Quantity | Value | Units | Method | Reference | Comment |
---|---|---|---|---|---|
ΔrH° | 40.20 ± 0.60 | kcal/mol | KinS | Graham and Angelici, 1967 | solvent: Decalin; The reaction enthalpy and entropy were identified with the enthalpy and entropy of activation for the reaction of Cr(CO)6(solution) with PBu3(solution). |
ΔrH° | 38.10 | kcal/mol | KinS | Werner and Prinz, 1966 | solvent: n-Decane+cyclohexane mixture; The reaction enthalpy and entropy were identified with the enthalpy and entropy of activation for the reactions of Cr(CO)6(solution) with a phosphine and an amine. The results were quoted from Graham and Angelici, 1967. |
(g) = C5CrO5 (g) +
(g)
By formula: C6CrO6 (g) = C5CrO5 (g) + CO (g)
Quantity | Value | Units | Method | Reference | Comment |
---|---|---|---|---|---|
ΔrH° | 37.0 ± 5.0 | kcal/mol | KinG | Fletcher and Rosenfeld, 1988 | |
ΔrH° | 36.8 ± 3.0 | kcal/mol | LPHP | Lewis, Golden, et al., 1984 | Temperature range: 740-820 K. The reaction enthalpy at 298 K relies on an activation energy of 35.30 kcal/mol and assumes a negligible activation barrier for product recombination. |
ΔrH° | 38.70 | kcal/mol | KinG | Pajaro, Calderazzo, et al., 1960 | Please also see Graham and Angelici, 1967. The reaction enthalpy and entropy were identified with the enthalpy and entropy of activation for the reaction of Cr(CO)6(g) with CO(g) Pajaro, Calderazzo, et al., 1960. The results were quoted from Graham and Angelici, 1967. |
C10H5CrNO5 (solution) + (solution) =
(solution) +
(solution)
By formula: C10H5CrNO5 (solution) + CO (solution) = C6CrO6 (solution) + C4H4N2 (solution)
Quantity | Value | Units | Method | Reference | Comment |
---|---|---|---|---|---|
ΔrH° | -14.8 | kcal/mol | KinS | Wovkulich and Atwood, 1980 | solvent: Hexane; The data rely on the enthalpy and entropy of activation for the forward reaction, 25.4 ± 1.1 kcal/mol and 13.0±14.6 J/(mol K) Dennenberg and Darensbourg, 1972, and also on the enthalpy and entropy of activation for the Cr-CO dissociation in Cr(CO)6, 40.20 ± 0.60 kcal/mol and 94.6±6.3 J/(mol K) Graham and Angelici, 1967. The latter data were obtained in decalin |
By formula: C6CrO6 (cr) = 6CO (g) + Cr (cr)
Quantity | Value | Units | Method | Reference | Comment |
---|---|---|---|---|---|
ΔrH° | 63.6 ± 1. | kcal/mol | TD-HFC | Al-Takhin, Connor, et al., 1984, 2 | |
ΔrH° | 75.3 ± 0.2 | kcal/mol | TD-HZC | Pittam, Pilcher, et al., 1975 | Please also see Pedley and Rylance, 1977 and Tel'noi and Rabinovich, 1977. |
ΔrH° | 64.4 ± 1.1 | kcal/mol | TD-HFC | Connor, Skinner, et al., 1972 |
(solution) +
(solution) = C10H12CrO5 (solution) +
(solution)
By formula: C5H12 (solution) + C6CrO6 (solution) = C10H12CrO5 (solution) + CO (solution)
Quantity | Value | Units | Method | Reference | Comment |
---|---|---|---|---|---|
ΔrH° | 27.9 ± 2.5 | kcal/mol | PAC | Morse, Parker, et al., 1989 | solvent: Pentane; The reaction enthalpy relies on 0.67 for the quantum yield of CO dissociation |
C10H5CrNO5 (cr) + (g) =
(g) +
(g)
By formula: C10H5CrNO5 (cr) + CO (g) = C6CrO6 (g) + C4H4N2 (g)
Quantity | Value | Units | Method | Reference | Comment |
---|---|---|---|---|---|
ΔrH° | 18. ± 1. | kcal/mol | DSC | Daamen, van der Poel, et al., 1979 |
(g) = 3
(g) + C3CrO3 (g)
By formula: C6CrO6 (g) = 3CO (g) + C3CrO3 (g)
Quantity | Value | Units | Method | Reference | Comment |
---|---|---|---|---|---|
ΔrH° | 94. ± 10. | kcal/mol | MBPS | Venkataraman, Hou, et al., 1990 |

References

Pittam, Pilcher, et al., 1975
Pittam, D.A.; Pilcher, G.; Barnes, D.S.; Skinner, H.A.; Todd, D.,
J. Less-Common Met., 1975, 42, 217. [all data]
Pedley and Rylance, 1977
Pedley, J.B.; Rylance, J.,
Computer Analysed Thermochemical Data: Organic and Organometallic Compounds, University of Sussex, Brigton, 1977. [all data]
Tel'noi and Rabinovich, 1977
Tel'noi, V.I.; Rabinovich, I.B.,
Russ. Chem. Rev., 1977, 46, 689. [all data]
Shuman, Chernova, et al., 1974
Shuman, M.S.; Chernova, V.I.; Zakharov, V.V.; Rabinovich, I.B.,
Trudy Khim. Khim. Tekhnol., Gorky, 1974, 1, 78. [all data]
Cotton, Fischer, et al., 1956
Cotton, F.A.; Fischer, A.K.; Wilkinson. G.,
J. Am. Chem. Soc., 1956, 78, 5168. [all data]
Cox and Pilcher, 1970
Cox, J.D.; Pilcher, G.,
Thermochemistry of Organic and Organometallic Compounds
in Academic Press, New York, 1970. [all data]
Al-Takhin, Connor, et al., 1984
Al-Takhin, Ghassan; Connor, Joseph A.; Skinner, Henry A.; Zafarani-Moattar, Mohamed T.,
Thermochemistry of arenetricarbonylchromium complexes containing toluene, anisole, N,N-dimethylaninine, acetophenone and methylbenzoate,
Journal of Organometallic Chemistry, 1984, 260, 2, 189-197, https://doi.org/10.1016/S0022-328X(00)98694-7
. [all data]
Pilcher and Skinner, 1983
Pilcher, G.; Skinner, H.A.,
Thermochemistry of organometallic compounds, 1983, 43-90, https://doi.org/10.1002/9780470771686.ch2
. [all data]
Pittam, Pilcher, et al., 1975, 2
Pittam, D.A.; Pilcher, G.; Barnes, D.S.; Skinner, H.A.; Todd, D.,
The enthalpy of formation of chromium hexacarbonyl,
Journal of the Less Common Metals, 1975, 42, 2, 217-222, https://doi.org/10.1016/0022-5088(75)90007-7
. [all data]
Ribeiro Da Silva and Reis, 1983
Ribeiro Da Silva, Manuel A.V.; Reis, Ana Maria M.V.,
The standard molar enthalpies of formation of bis(benzoylacetonato)-beryllium(II) and tris(benzoylacetonato)-aluminium(III) and the mean molar metal-oxygen bond-dissociation enthalpies,
The Journal of Chemical Thermodynamics, 1983, 15, 10, 957-963, https://doi.org/10.1016/0021-9614(83)90129-5
. [all data]
Daamen, Ernsting, et al., 1979
Daamen, H.; Ernsting, J.M.; Oskam, A.,
Thermochim. Acta, 1979, 33, 217. [all data]
Boxhoorn, Ernsting, et al., 1980
Boxhoorn, G.; Ernsting, J.M.; Stufkens, D.J.; Oskam, A.,
Thermochim. Acta, 1980, 42, 315. [all data]
Hieber and Romberg, 1935
Hieber, W.; Romberg, E.,
Z. Anorg. Allg. Chem., 1935, 221, 321. [all data]
Pilcher, Ware, et al., 1975
Pilcher, G.; Ware, M.J.; Pittam, D.A.,
J. Less-Common Met., 1975, 42, 223. [all data]
Al-Takhin, Connor, et al., 1984, 2
Al-Takhin, G.; Connor, J.A.; Skinner, H.A.; Zaharani-Moettar, M.T.,
J. Organomet. Chem., 1984, 260, 189. [all data]
Rezukhina and Shvyrev, 1952
Rezukhina, T.N.; Shvyrev, V.V.,
Vestn. Moskov. Univ., 1952, 7, 41. [all data]
Adedeji, Lalage, et al., 1975
Adedeji, Festus A.; Lalage, D.; Brown, S.; Connor, Joseph A.; Leung, May L.; Paz-Andrade, I. Maria; Skinner, Henry A.,
Thermochemistry of arene chromium tricarbonyls and the strenghts of arene-chromium bonds,
Journal of Organometallic Chemistry, 1975, 97, 2, 221-228, https://doi.org/10.1016/S0022-328X(00)89468-1
. [all data]
Stull, 1947
Stull, Daniel R.,
Vapor Pressure of Pure Substances. Organic and Inorganic Compounds,
Ind. Eng. Chem., 1947, 39, 4, 517-540, https://doi.org/10.1021/ie50448a022
. [all data]
Pankajavalli, Mallika, et al., 2002
Pankajavalli, R.; Mallika, C.; Sreedharan, O.M.; Raghunathan, V.S.; Antony Premkumar, P.; Nagaraja, K.S.,
Thermal stability of organo-chromium or chromium organic complexes and vapor pressure measurements on tris(2,4-pentanedionato)chromium(III) and hexacarbonyl chromium(0) by TG-based transpiration method,
Chemical Engineering Science, 2002, 57, 17, 3603-3610, https://doi.org/10.1016/S0009-2509(02)00248-8
. [all data]
Garner, Chandra, et al., 1995
Garner, M.L.; Chandra, D.; Lau, K.H.,
Low-temperature vapor pressures of W-, Cr-, and Co-carbonyls,
JPE, 1995, 16, 1, 24-29, https://doi.org/10.1007/BF02646245
. [all data]
Baev, 1993
Baev, A.K.,
Thermodynamic properties of the mixtures of chromium and tungsten hexacarbonyls,
Zh. Fiz. Khim., 1993, 67, 12, 2399. [all data]
Stephenson and Malanowski, 1987
Stephenson, Richard M.; Malanowski, Stanislaw,
Handbook of the Thermodynamics of Organic Compounds, 1987, https://doi.org/10.1007/978-94-009-3173-2
. [all data]
Boxhoorn, Ernsting, et al., 1980, 2
Boxhoorn, G.; Ernsting, J.M.; Stufkens, D.J.; Oskam, A.,
Vapour pressure measurements on M(CO)5L complexes (M «58875» Cr, W; L «58875» CO, P(OØ)3, PØ3, PMe3, NMe3 and pyridazine),
Thermochimica Acta, 1980, 42, 3, 315-321, https://doi.org/10.1016/0040-6031(80)85092-1
. [all data]
Daamen, Ernsting, et al., 1979, 2
Daamen, H.; Ernsting, J.M.; Oskam, A.,
Vapour pressure measurements on M(CO)5L (M = Cr, Mo, W; L = piperidine, pyridine, pyrazine, pyrazole, thiazole),
Thermochimica Acta, 1979, 33, 217-223, https://doi.org/10.1016/0040-6031(79)87044-6
. [all data]
Boni, 1966
Boni, A.A.,
The Vapor Pressures of Titanium Tetrabromide and Chromium Carbonyl,
J. Electrochem. Soc., 1966, 113, 10, 1089, https://doi.org/10.1149/1.2423762
. [all data]
Windsor and Blanchard, 1934
Windsor, Manly M.; Blanchard, Arthur A.,
The Vapor Pressure and Molecular Weight of Chromium Carbonyl,
J. Am. Chem. Soc., 1934, 56, 4, 823-825, https://doi.org/10.1021/ja01319a015
. [all data]
Hunter and Lias, 1998
Hunter, E.P.; Lias, S.G.,
Evaluated Gas Phase Basicities and Proton Affinities of Molecules: An Update,
J. Phys. Chem. Ref. Data, 1998, 27, 3, 413-656, https://doi.org/10.1063/1.556018
. [all data]
Cooper, Green, et al., 1987
Cooper, G.; Green, J.C.; Payne, M.; Dobson, B.R.; Hillier, I.H.,
Photoelectron spectroscopy with variable photon energy: A study of the metal hexacarbonyls, M(CO)6, Where M = CR, MO, and W.,
J. Am. Chem. Soc., 1987, 109, 3836. [all data]
Das, Nishimura, et al., 1985
Das, P.R.; Nishimura, T.; Meisels, G.G.,
Fragmentation of energy-selected hexacarbonylchromium ion,
J. Phys. Chem., 1985, 89, 2808. [all data]
Hubbard and Lichtenberger, 1982
Hubbard, J.L.; Lichtenberger, D.L.,
Vibrational fine structure in the valence ionizations of transition-metal hexacarbonyls: New experimental indication of metal-to-carbonyl π bonding,
J. Am. Chem. Soc., 1982, 104, 2132. [all data]
Michels, Flesch, et al., 1980
Michels, G.D.; Flesch, G.D.; Svec, H.J.,
Comparative mass spectrometry of the group 6B hexacarbonyls and pentacarbonyl thiocarbonyls,
Inorg. Chem., 1980, 19, 479. [all data]
Paetzold and Abd-el-Mottaleb, 1975
Paetzold, R.; Abd-el-Mottaleb, S.,
Correlative studies of some spectroscopic and bonding parameters in octahedrally coordinated metal carbonyl complexes,
J. Mol. Struct., 1975, 24, 357. [all data]
Muller, Fenderl, et al., 1971
Muller, J.; Fenderl, K.; Mertschenk, B.,
Die Donor-Akzeptor-Eigenschaften des Liganden Trifluorphosphin in Ubergangsmetallkomplexen,
Chem. Ber., 1971, 104, 700. [all data]
Fischer, Kreiter, et al., 1971
Fischer, E.O.; Kreiter, C.G.; Kollmeier, H.J.; Muller, J.; Fischer, R.D.,
Ubergangsmetall- carben-komplexe. XXVII. Ringsubstituierte (methoxyphenylcarben)-pentacarbonylchrom(0)- komplexe,
J. Organomet. Chem., 1971, 28, 237. [all data]
Lloyd and Schlag, 1969
Lloyd, D.R.; Schlag, E.W.,
Photoionization studies of metal carbonyls. I. Ionization potentials and the bonding in group VI metal hexacarbonyls and in mononuclear carbonyls and nitrosyl carbonyls of iron, cobalt, and nickel,
Inorg. Chem., 1969, 8, 2544. [all data]
English, Plowman, et al., 1979
English, A.M.; Plowman, K.R.; Butler, I.S.; Diemann, E.; Muller, A.,
He(I) photoelectron spectra of pentacarbonyl(selenocarbonyl)chromium(0) related complexes,
Inorg. Chim. Acta, 1979, 32, 113. [all data]
Block and Fenske, 1977
Block, T.F.; Fenske, R.F.,
A photoelectron spectroscopic study of some pentacarbonylchromium carbene complexes,
J. Am. Chem. Soc., 1977, 99, 4321. [all data]
Head, Nixon, et al., 1975
Head, R.A.; Nixon, J.F.; Sharp, G.J.; Clark, R.J.,
Photoelectron spectroscopic study of metal trifluorophosphine and hydridotrifluorophosphine complexes,
J. Chem. Soc. Dalton Trans., 1975, 2054. [all data]
Higginson, Lloyd, et al., 1973
Higginson, B.R.; Lloyd, D.R.; Burroughs, P.; Gibson, D.M.; Orchard, A.F.,
Photoelectron studies of metal carbonyls. Part 2. The valence region photoelectron spectra of the Group VIA hexacarbonyls,
J. Chem. Soc. Faraday Trans. 2, 1973, 1659. [all data]
Caulton and Fenske, 1968
Caulton, K.G.; Fenske, R.F.,
Electronic structure and bonding in V(CO)6-, Cr(CO)6, and Mn(CO)6+,
Inorg. Chem., 1968, 7, 1273. [all data]
Bidinosti and McIntyre, 1967
Bidinosti, D.R.; McIntyre, N.S.,
Electron-impact study of some binary metal carbonyls,
Can. J. Chem., 1967, 45, 641. [all data]
Junk and Svec, 1968
Junk, G.A.; Svec, H.J.,
Energetics of the ionization and dissociation of Ni(CO)4, Fe(CO)5, Cr(CO)6, Mo(CO)6 and W(CO)6,
Z. Naturforsch., 1968, 23b, 1. [all data]
Winters and Kiser, 1965
Winters, R.E.; Kiser, R.W.,
Mass spectrometric studies of chromium, molybdenum, and tungsten hexacarbonyls,
Inorg. Chem., 1965, 4, 157. [all data]
Foffani, Pignataro, et al., 1965
Foffani, A.; Pignataro, S.; Cantone, B.; Grasso, F.,
Mass spectra of metal hexacarbonyls,
Z. Physik. Chem. (Frankfurt), 1965, 45, 79. [all data]