Cyanocyclopentadienyl radical
- Formula: C6H4N
- Molecular weight: 90.1027
- IUPAC Standard InChIKey: VWKLXRWHQINATQ-UHFFFAOYSA-N
- CAS Registry Number: 129836-93-7
- Chemical structure:
View 3d structure (requires JavaScript / HTML 5) - Permanent link for this species. Use this link for bookmarking this species for future reference.

Gas phase ion energetics data

Data compiled as indicated in comments:
LL - Sharon G. Lias and Joel F. Liebman
RDSH - Henry M. Rosenstock, Keith Draxl, Bruce W. Steiner, and John T. Herron
Ionization energy determinations
IE (eV) | Method | Reference | Comment |
---|---|---|---|
9.05 ± 0.02 | LS | Im and Bernstein, 1991 | LL |
9.44 | EI | Pottie and Lossing, 1963 | RDSH |

References

Im and Bernstein, 1991
Im, H.S.; Bernstein, E.R.,
Mass resolved excitation spectroscopy of radicals: benzyl and phenylnitrene,
J. Chem. Phys., 1991, 95, 6326. [all data]
Pottie and Lossing, 1963
Pottie, R.F.; Lossing, F.P.,
Free radicals by mass spectrometry. XXIX. Ionization potentials of substituted cyclopentadienyl radicals,
J. Am. Chem. Soc., 1963, 85, 269. [all data]