9,10-Anthracenedione, 1-hydroxy-
- Formula: C14H8O3
- Molecular weight: 224.2115
- IUPAC Standard InChIKey: BTLXPCBPYBNQNR-UHFFFAOYSA-N
- CAS Registry Number: 129-43-1
- Chemical structure:
View 3d structure (requires JavaScript / HTML 5) - Other names: Anthraquinone, 1-hydroxy-; α-Hydroxyanthraquinone; 1-Hydroxyanthraquinone; 1-Hydroxy-9,10-anthraquinone; 1-Hydroxyanthrachinon

Phase change data

Data compiled by: William E. Acree, Jr., James S. Chickos
Enthalpy of sublimation
ΔsubH (kcal/mol) | Temperature (K) | Method | Reference | Comment |
---|---|---|---|---|
24.21 ± 0.1 | 407. | HSA | Beynon and Nicholson, 2002 | |
28.82 | 358. | N/A | Hoyer and Peperle, 1958 | Based on data from 333. to 383. K. See also Stephenson and Malanowski, 1987. |

Gas phase ion energetics data

Data compiled by: Sharon G. Lias, Rhoda D. Levin, and Sherif A. Kafafi
Ionization energy determinations
IE (eV) | Method | Reference |
---|---|---|
8.43 ± 0.05 | PI | Potapov and Sorokin, 1971 |

References

Beynon and Nicholson, 2002
Beynon, J.H.; Nicholson, G.R.,
A radioactive ionization gauge and its application to the measurement of latent heat of vaporization,
J. Sci. Instrum., 2002, 33, 10, 376-380, https://doi.org/10.1088/0950-7671/33/10/302
. [all data]
Hoyer and Peperle, 1958
Hoyer, H.; Peperle, W.,
Z. Elektrochem., 1958, 62, 61. [all data]
Stephenson and Malanowski, 1987
Stephenson, Richard M.; Malanowski, Stanislaw,
Handbook of the Thermodynamics of Organic Compounds, 1987, https://doi.org/10.1007/978-94-009-3173-2
. [all data]
Potapov and Sorokin, 1971
Potapov, V.K.; Sorokin, V.V.,
Photoionization and ion-molecule reactions in quinones and alcohols,
High Energy Chem., 1971, 5, 435, In original 487. [all data]