Molybdenum,bis(η-2,4-cyclopentadien-1-yl)dihydro-
- Formula: C10H12Mo
- Molecular weight: 228.16
- CAS Registry Number: 1291-40-3

Gas phase thermochemistry data

Data compiled by: José A. Martinho Simões
Quantity | Value | Units | Method | Reference | Comment |
---|---|---|---|---|---|
ΔfH°gas | 276.9 ± 3.1 | kJ/mol | Review | Martinho Simões | |
ΔfH°gas | 294.6 ± 6.2 | kJ/mol | Review | Martinho Simões | Selected data. The enthalpy of formation relies on -96.3 ± 2.9 kJ/mol for the enthalpy of formation of Mo(Cp)2(Cl)2(cr) |

Condensed phase thermochemistry data

Data compiled by: José A. Martinho Simões
Quantity | Value | Units | Method | Reference | Comment |
---|---|---|---|---|---|
ΔfH°solid | 195.5 ± 2.9 | kJ/mol | Review | Martinho Simões | |
ΔfH°solid | 213.2 ± 6.1 | kJ/mol | Review | Martinho Simões | Selected data. The enthalpy of formation relies on -96.3 ± 2.9 kJ/mol for the enthalpy of formation of Mo(Cp)2(Cl)2(cr) |
Quantity | Value | Units | Method | Reference | Comment |
ΔcH°solid | -6590.2 ± 2.5 | kJ/mol | CC-SB | Tel'noi, Rabinovich, et al., 1976 | Please also see Tel'noi and Rabinovich, 1977. |

Gas phase ion energetics data

Data compiled as indicated in comments:
LLK - Sharon G. Lias, Rhoda D. Levin, and Sherif A. Kafafi
Ionization energy determinations
IE (eV) | Method | Reference | Comment |
---|---|---|---|
6.4 ± 0.1 | PE | Green, Jackson, et al., 1975 | Vertical value; LLK |

Phase change data

Data compiled by: José A. Martinho Simões

Quantity Value Units Method Reference Comment
Δsub81.4 ± 1.0kJ/molCC-SBDias, Diogo, et al., 1990Another value for the enthalpy of sublimation has been reported: 92.5 ± 2.1 kJ/mol Tel'noi, Rabinovich, et al., 1976

Reaction thermochemistry data

Data compiled by: José A. Martinho Simões

Individual Reactions

C10H12Mo (cr) + 2Iodine (cr) = C10H10I2Mo (cr) + 2Hydrogen iodide (g)

By formula: C10H12Mo (cr) + 2I2 (cr) = C10H10I2Mo (cr) + 2HI (g)

Quantity Value Units Method Reference Comment
Δr-87.8 ± 5.1kJ/molRSCCalado, Dias, et al., 1979

C10H12Mo (cr) + 2Carbon tetrabromide (cr) = C10H10Br2Mo (cr) + 2Methane, tribromo- (l)

By formula: C10H12Mo (cr) + 2CBr4 (cr) = C10H10Br2Mo (cr) + 2CHBr3 (l)

Quantity Value Units Method Reference Comment
Δr-296.5 ± 4.5kJ/molRSCCalado, Dias, et al., 1980

C10H12Mo (cr) + 2Carbon Tetrachloride (l) = C10H10Cl2Mo (cr) + 2Trichloromethane (l)

By formula: C10H12Mo (cr) + 2CCl4 (l) = C10H10Cl2Mo (cr) + 2CHCl3 (l)

Quantity Value Units Method Reference Comment
Δr-321.3 ± 4.4kJ/molRSCCalado, Dias, et al., 1979, 2

References

Martinho Simões
Martinho Simões, J.A.,
Private communication (see http://webbook.nist.gov/chemistry/om/). [all data]
Tel'noi, Rabinovich, et al., 1976
Tel'noi, V.I.; Rabinovich, I.B.; Kir'yanov, K.V.; Smirnov, A.S.,
Dokl. Akad. Nauk SSSR, 1976, 231, 733. [all data]
Tel'noi and Rabinovich, 1977
Tel'noi, V.I.; Rabinovich, I.B.,
Russ. Chem. Rev., 1977, 46, 689. [all data]
Green, Jackson, et al., 1975
Green, J.C.; Jackson, S.E.; Higginson, B.,
Photoelectron studies of some bent bis(n-cyclopentadienyl)metal complexes. Part I. Some eighteen-electron systems with hydride, alkyl, olefin, allyl, carbonyl ligands,
J. Chem. Soc. Dalton Trans., 1975, 403. [all data]