Pyrene
- Formula: C16H10
- Molecular weight: 202.2506
- IUPAC Standard InChIKey: BBEAQIROQSPTKN-UHFFFAOYSA-N
- CAS Registry Number: 129-00-0
- Chemical structure:
View 3d structure (requires JavaScript / HTML 5) - Other names: β-Pyrene; Benzo[def]phenanthrene; Pyren; Coal tar pitch volatiles:pyrene

Gas phase thermochemistry data

Data compiled as indicated in comments:
DRB - Donald R. Burgess, Jr.
ALS - Hussein Y. Afeefy, Joel F. Liebman, and Stephen E. Stein
GT - Glushko Thermocenter, Russian Academy of Sciences, Moscow
Quantity | Value | Units | Method | Reference | Comment |
---|---|---|---|---|---|
ΔfH°gas | 53.90 ± 0.60 | kcal/mol | Review | Roux, Temprado, et al., 2008 | There are sufficient literature values to make a qualified recommendation where the suggested value is in good agreement with values predicted using thermochemical cycles or from reliable estimates. In general, the evaluated uncertainty limits are on the order of (2 to 4) kJ/mol.; DRB |
ΔfH°gas | 53.94 ± 0.31 | kcal/mol | Ccr | Smith, Stewart, et al., 1980 | ALS |
ΔfH°gas | 51.36 | kcal/mol | N/A | Westrum and Wong, 1967 | Value computed using ΔfHsolid° value of 114.7±0.4 kj/mol from Westrum and Wong, 1967 and ΔsubH° value of 100.2 kj/mol from Smith, Stewart, et al., 1980.; DRB |
ΔfH°gas | 51.36 | kcal/mol | N/A | Richardson and Parks, 1939 | Value computed using ΔfHsolid° value of 114.7±3.6 kj/mol from Richardson and Parks, 1939 and ΔsubH° value of 100.2 kj/mol from Smith, Stewart, et al., 1980.; DRB |
Constant pressure heat capacity of gas
Cp,gas (cal/mol*K) | Temperature (K) | Reference | Comment |
---|---|---|---|
9.632 | 50. | Dorofeeva O.V., 1988 | These functions are also reproduced in the reference book [ Frenkel M., 1994]. Recommended entropy and heat capacity values are in close agreement with other statistically calculated values [ Smith N.K., 1980] at T=400-500 K. The disagreement increases up to 2 J/mol*K for T=200 and 600 K.; GT |
15.01 | 100. | ||
22.47 | 150. | ||
31.047 | 200. | ||
44.304 | 273.15 | ||
48.80 ± 0.24 | 298.15 | ||
49.135 | 300. | ||
65.856 | 400. | ||
79.730 | 500. | ||
90.791 | 600. | ||
99.603 | 700. | ||
106.71 | 800. | ||
112.54 | 900. | ||
117.37 | 1000. | ||
121.41 | 1100. | ||
124.82 | 1200. | ||
127.72 | 1300. | ||
130.19 | 1400. | ||
132.32 | 1500. |

Condensed phase thermochemistry data

Data compiled as indicated in comments:
DRB - Donald R. Burgess, Jr.
ALS - Hussein Y. Afeefy, Joel F. Liebman, and Stephen E. Stein
DH - Eugene S. Domalski and Elizabeth D. Hearing
Quantity | Value | Units | Method | Reference | Comment |
---|---|---|---|---|---|
ΔfH°solid | 29.92 ± 0.55 | kcal/mol | Review | Roux, Temprado, et al., 2008 | There are sufficient literature values to make a qualified recommendation where the suggested value is in good agreement with values predicted using thermochemical cycles or from reliable estimates. In general, the evaluated uncertainty limits are on the order of (2 to 4) kJ/mol.; DRB |
ΔfH°solid | 29.99 ± 0.30 | kcal/mol | Ccr | Smith, Stewart, et al., 1980 | ALS |
ΔfH°solid | 27.41 ± 0.09 | kcal/mol | Ccr | Westrum and Wong, 1967 | ALS |
ΔfH°solid | 27.42 ± 0.85 | kcal/mol | Ccb | Richardson and Parks, 1939 | Reanalyzed by Cox and Pilcher, 1970, Original value = 26.90 kcal/mol; see Richardson, 1939; ALS |
Quantity | Value | Units | Method | Reference | Comment |
ΔcH°solid | -1876.4 ± 0.24 | kcal/mol | Ccr | Smith, Stewart, et al., 1980 | Corresponding ΔfHºsolid = 29.97 kcal/mol (simple calculation by NIST; no Washburn corrections); ALS |
ΔcH°solid | -1873.83 ± 0.09 | kcal/mol | Ccr | Westrum and Wong, 1967 | Corresponding ΔfHºsolid = 27.44 kcal/mol (simple calculation by NIST; no Washburn corrections); ALS |
ΔcH°solid | -1873.81 ± 0.84 | kcal/mol | Ccb | Richardson and Parks, 1939 | Reanalyzed by Cox and Pilcher, 1970, Original value = -1872.97 kcal/mol; see Richardson, 1939; Corresponding ΔfHºsolid = 27.42 kcal/mol (simple calculation by NIST; no Washburn corrections); ALS |
Quantity | Value | Units | Method | Reference | Comment |
S°solid,1 bar | 53.750 | cal/mol*K | N/A | Wong and Westrum, 1971 | DH |
S°solid,1 bar | 51.41 | cal/mol*K | N/A | Jacobs and Parks, 1934 | Extrapolation below 90 K, 59.79 J/mol*K. Hump in Cp curve around 116 K, probably 2nd order transition. H = 100 J/mol.; DH |
Constant pressure heat capacity of solid
Cp,solid (cal/mol*K) | Temperature (K) | Reference | Comment |
---|---|---|---|
54.818 | 298.15 | Smith, Stewart, et al., 1980 | DH |
54.900 | 298.15 | Wong and Westrum, 1971 | T = 5 to 484 K.; DH |
54.410 | 291.1 | Jacobs and Parks, 1934 | T = 94 to 292 K. Value is unsmoothed experimental datum.; DH |

Phase change data

Data compiled as indicated in comments:
TRC - Thermodynamics Research Center, NIST Boulder Laboratories, Chris Muzny director
AC - William E. Acree, Jr., James S. Chickos
DRB - Donald R. Burgess, Jr.
ALS - Hussein Y. Afeefy, Joel F. Liebman, and Stephen E. Stein
CAL - James S. Chickos, William E. Acree, Jr., Joel F. Liebman, Students of Chem 202 (Introduction to the Literature of Chemistry), University of Missouri -- St. Louis
DH - Eugene S. Domalski and Elizabeth D. Hearing
Quantity | Value | Units | Method | Reference | Comment |
---|---|---|---|---|---|
Tfus | 424. ± 3. | K | AVG | N/A | Average of 8 values; Individual data points |
Quantity | Value | Units | Method | Reference | Comment |
Ttriple | 423.81 | K | N/A | Wong and Westrum, 1971, 2 | Crystal phase 1 phase; Uncertainty assigned by TRC = 0.01 K; TRC |
Quantity | Value | Units | Method | Reference | Comment |
ΔvapH° | 22.1 ± 0.26 | kcal/mol | CGC | Hanshaw, Nutt, et al., 2008 | AC |
ΔvapH° | 20.8 ± 0.31 | kcal/mol | GC | Teodorescu, Barhala, et al., 2006 | Based on data from 423. to 493. K.; AC |
Quantity | Value | Units | Method | Reference | Comment |
ΔsubH° | 24.98 | kcal/mol | ME | Siddiqi, Siddiqui, et al., 2009 | Based on data from 341. to 418. K.; AC |
ΔsubH° | 23.97 ± 0.24 | kcal/mol | Review | Roux, Temprado, et al., 2008 | There are sufficient high-quality literature values to make a good evaluation with a high degree of confidence. In general, the evaluated uncertainty limits are on the order of (0.5 to 2.5) kJ/mol.; DRB |
ΔsubH° | 23.5 ± 0.24 | kcal/mol | DSC | Rojas and Orozco, 2003 | AC |
ΔsubH° | 23.95 ± 0.1 | kcal/mol | V | Smith, Stewart, et al., 1980 | ALS |
ΔsubH° | 23.95 | kcal/mol | N/A | Smith, Stewart, et al., 1980 | DRB |
Enthalpy of vaporization
ΔvapH (kcal/mol) | Temperature (K) | Method | Reference | Comment |
---|---|---|---|---|
18.8 | 398. | GC | Hinckley, Bidleman, et al., 1990 | Based on data from 343. to 453. K.; AC |
18. | 428. | N/A | Sasse, Jose, et al., 1988 | Based on data from 413. to 467. K.; AC |
17. | 528. | A | Stephenson and Malanowski, 1987 | Based on data from 513. to 668. K. See also Tsypikina and Ya, 1955.; AC |
18.3 | 440. | N/A | Smith, Stewart, et al., 1980 | Based on data from 398. to 458. K.; AC |
Antoine Equation Parameters
log10(P) = A − (B / (T + C))
P = vapor pressure (atm)
T = temperature (K)
View plot Requires a JavaScript / HTML 5 canvas capable browser.
Temperature (K) | A | B | C | Reference | Comment |
---|---|---|---|---|---|
473.6 to 667.9 | 2.68142 | 1086.824 | -262.849 | Tsypkina, 1955 | Coefficents calculated by NIST from author's data. |
Enthalpy of sublimation
ΔsubH (kcal/mol) | Temperature (K) | Method | Reference | Comment |
---|---|---|---|---|
24.69 ± 0.50 | 380. | ME | Siddiqi, Siddiqui, et al., 2009 | Based on data from 341. to 418. K.; AC |
24.6 ± 1.6 | 353. | ME | Oja and Suuberg, 1998 | Based on data from 308. to 398. K.; AC |
23.4 | 383. | GS | Nass, Lenoir, et al., 1995 | Based on data from 313. to 453. K.; AC |
23.97 ± 0.07 | 353. | PG | Sasse, Jose, et al., 1988 | Based on data from 369. to 383. K.; AC |
21.8 ± 0.1 | 303. | GS | Sonnefeld, Zoller, et al., 1983 | Based on data from 283. to 323. K.; AC |
23.95 ± 0.1 | 410. | IP | Smith, Stewart, et al., 1980 | Based on data from 398. to 423. K.; AC |
24.09 ± 0.36 | 348. to 419. | ME | Malaspina, Bardi, et al., 1974 | AC |
24.02 | 330. | ME | Hoyer and Peperle, 1958 | Based on data from 298. to 363. K.; AC |
22.500 | 344.75 | V | Bradley and Cleasby, 1953 | ALS |
23.92 ± 0.41 | 351. | ME | Inokuchi, Shiba, et al., 1952 | Based on data from 345. to 358. K.; AC |
Enthalpy of fusion
ΔfusH (kcal/mol) | Temperature (K) | Method | Reference | Comment |
---|---|---|---|---|
3.99 | 422.4 | DSC | Rojas and Orozco, 2003 | Based on data from 403. to 433. K.; AC |
4.149 | 423.8 | N/A | Domalski and Hearing, 1996 | AC |
Entropy of fusion
ΔfusS (cal/mol*K) | Temperature (K) | Reference | Comment |
---|---|---|---|
0.571 | 120.8 | Domalski and Hearing, 1996 | CAL |
9.792 | 423.8 |
Enthalpy of phase transition
ΔHtrs (kcal/mol) | Temperature (K) | Initial Phase | Final Phase | Reference | Comment |
---|---|---|---|---|---|
0.0691 | 120.8 | crystaline, II | crystaline, I | Wong and Westrum, 1971 | DH |
4.1501 | 423.81 | crystaline, I | liquid | Wong and Westrum, 1971 | DH |
Entropy of phase transition
ΔStrs (cal/mol*K) | Temperature (K) | Initial Phase | Final Phase | Reference | Comment |
---|---|---|---|---|---|
0.550 | 120.8 | crystaline, II | crystaline, I | Wong and Westrum, 1971 | DH |
9.792 | 423.81 | crystaline, I | liquid | Wong and Westrum, 1971 | DH |

Reaction thermochemistry data

Data compiled by: Michael M. Meot-Ner (Mautner) and Sharon G. Lias
Individual Reactions
By formula: C16H10+ + C16H10 = (C16H10+ • C16H10)
Bond type: Charge transfer bond (positive ion)
Quantity | Value | Units | Method | Reference | Comment |
---|---|---|---|---|---|
ΔrH° | 19.1 | kcal/mol | PHPMS | Meot-Ner (Mautner), 1980 | gas phase; Entropy change calculated or estimated |
Quantity | Value | Units | Method | Reference | Comment |
ΔrS° | 28. | cal/mol*K | N/A | Meot-Ner (Mautner), 1980 | gas phase; Entropy change calculated or estimated |
Free energy of reaction
ΔrG° (kcal/mol) | T (K) | Method | Reference | Comment |
---|---|---|---|---|
8.2 | 390. | PHPMS | Meot-Ner (Mautner), 1980 | gas phase; Entropy change calculated or estimated |
By formula: C16H11+ + C16H10 = (C16H11+ • C16H10)
Quantity | Value | Units | Method | Reference | Comment |
---|---|---|---|---|---|
ΔrH° | 16.5 | kcal/mol | PHPMS | Meot-Ner (Mautner), 1980 | gas phase |
Quantity | Value | Units | Method | Reference | Comment |
ΔrS° | 29. | cal/mol*K | PHPMS | Meot-Ner (Mautner), 1980 | gas phase |

Henry's Law data

Data compiled by: Rolf Sander
Henry's Law constant (water solution)
kH(T) = k°H exp(d(ln(kH))/d(1/T) ((1/T) - 1/(298.15 K)))
k°H = Henry's law constant for solubility in water at 298.15 K (mol/(kg*bar))
d(ln(kH))/d(1/T) = Temperature dependence constant (K)
k°H (mol/(kg*bar)) | d(ln(kH))/d(1/T) (K) | Method | Reference |
---|---|---|---|
84. | L | N/A | |
92. | M | N/A |

Gas phase ion energetics data

Data evaluated as indicated in comments:
HL - Edward P. Hunter and Sharon G. Lias
L - Sharon G. Lias
Data compiled as indicated in comments:
MM - Michael M. Meot-Ner (Mautner)
LL - Sharon G. Lias and Joel F. Liebman
LLK - Sharon G. Lias, Rhoda D. Levin, and Sherif A. Kafafi
RDSH - Henry M. Rosenstock, Keith Draxl, Bruce W. Steiner, and John T. Herron
B - John E. Bartmess
Quantity | Value | Units | Method | Reference | Comment |
---|---|---|---|---|---|
IE (evaluated) | 7.426 ± 0.001 | eV | N/A | N/A | L |
Quantity | Value | Units | Method | Reference | Comment |
Proton affinity (review) | 207.7 | kcal/mol | N/A | Hunter and Lias, 1998 | HL |
Quantity | Value | Units | Method | Reference | Comment |
Gas basicity | 200.8 | kcal/mol | N/A | Hunter and Lias, 1998 | HL |
Electron affinity determinations
EA (eV) | Method | Reference | Comment |
---|---|---|---|
0.406 ± 0.010 | LPES | Ando, Kokubo, et al., 2004 | B |
0.39002 | ECD | Wentworth and Becker, 1962 | B |
0.500 ± 0.030 | ECD | Lyons, Morris, et al., 1968 | B |
0.5910 ± 0.0080 | ECD | Becker and Chen, 1966 | B |
Proton affinity at 298K
Proton affinity (kcal/mol) | Reference | Comment |
---|---|---|
207.4 | Aue, Guidoni, et al., 2000 | Experimental literature data re-evaluated by the authors using ab initio protonation entropies; MM |
Gas basicity at 298K
Gas basicity (review) (kcal/mol) | Reference | Comment |
---|---|---|
201.2 | Aue, Guidoni, et al., 2000 | Experimental literature data re-evaluated by the authors using ab initio protonation entropies; MM |
Ionization energy determinations
IE (eV) | Method | Reference | Comment |
---|---|---|---|
7.4256 ± 0.0006 | LS | Hager and Wallace, 1988 | LL |
7.4 | PE | Clar, Robertson, et al., 1981 | LLK |
7.50 ± 0.05 | EQ | Mautner(Meot-Ner), 1980 | LLK |
7.41 | PE | Clar and Schmidt, 1979 | LLK |
7.45 ± 0.01 | PE | Dewar and Goodman, 1972 | LLK |
7.7 ± 0.3 | EI | Wacks, 1964 | RDSH |
7.70 | CTS | Kuroda, 1964 | RDSH |
7.31 | CTS | Finch, 1964 | RDSH |
7.72 | CTS | Briegleb, 1964 | RDSH |
7.48 | CTS | Kinoshita, 1962 | RDSH |
7.45 | CTS | Briegleb, Czekalla, et al., 1961 | RDSH |
7.55 | CTS | Birks and Stifkin, 1961 | RDSH |
7.53 | CTS | Briegleb and Czekalla, 1959 | RDSH |
7.58 | CTS | Matsen, 1956 | RDSH |
7.42 | PE | Akiyama, Li, et al., 1979 | Vertical value; LLK |
7.41 | PE | Clar and Schmidt, 1976 | Vertical value; LLK |
7.41 | PE | Boschi and Schmidt, 1972 | Vertical value; LLK |

Ion clustering data

Data compiled by: Michael M. Meot-Ner (Mautner) and Sharon G. Lias
Clustering reactions
By formula: C16H10+ + C16H10 = (C16H10+ • C16H10)
Bond type: Charge transfer bond (positive ion)
Quantity | Value | Units | Method | Reference | Comment |
---|---|---|---|---|---|
ΔrH° | 19.1 | kcal/mol | PHPMS | Meot-Ner (Mautner), 1980 | gas phase; Entropy change calculated or estimated |
Quantity | Value | Units | Method | Reference | Comment |
ΔrS° | 28. | cal/mol*K | N/A | Meot-Ner (Mautner), 1980 | gas phase; Entropy change calculated or estimated |
Free energy of reaction
ΔrG° (kcal/mol) | T (K) | Method | Reference | Comment |
---|---|---|---|---|
8.2 | 390. | PHPMS | Meot-Ner (Mautner), 1980 | gas phase; Entropy change calculated or estimated |
By formula: C16H11+ + C16H10 = (C16H11+ • C16H10)
Quantity | Value | Units | Method | Reference | Comment |
---|---|---|---|---|---|
ΔrH° | 16.5 | kcal/mol | PHPMS | Meot-Ner (Mautner), 1980 | gas phase |
Quantity | Value | Units | Method | Reference | Comment |
ΔrS° | 29. | cal/mol*K | PHPMS | Meot-Ner (Mautner), 1980 | gas phase |

Van Den Dool and Kratz RI, non-polar column, custom temperature program

Data compiled by: NIST Mass Spectrometry Data Center, William E. Wallace, director

Column type CapillaryCapillaryCapillaryCapillaryCapillary
Active phase HP-1HP-5DB-5OV-1015 % Phenyl methyl siloxane
Column length (m) 30.30.30.15.25.
Carrier gas   HeHeHe
Substrate
Column diameter (mm) 0.250.250.250.250.31
Phase thickness (μm) 0.250.250.250.250.52
Program 60C => 7C/min => 225C => 15C/min => 300C(11.43min)60C => 7C/min => 225C => 15C/min => 300C(11.43min)60 0C 7 0C/min -> 130 0C 5 0C/min -> 200 0C 6 0C/min -> 260 0C 20 0C/min -> 320 0C (4 min)50C(2min) => (20C/min) => 120C => (7C/min) => 310C(10min)50C(2min) => (20C/min) => 120C => (7C/min) => 310C(10min)
I 2069.72120.642136.2044.2089.
ReferenceDimitriou-Christidis, Harris, et al., 2003Dimitriou-Christidis, Harris, et al., 2003Havenga and Rohwer, 1999Yasuhara, Shiraishi, et al., 1997Yasuhara, Shiraishi, et al., 1997
Comment MSDC-RI MSDC-RI MSDC-RI MSDC-RI MSDC-RI
Column type CapillaryCapillary
Active phase Methyl SiliconeMethyl Silicone
Column length (m)
Carrier gas
Substrate
Column diameter (mm)
Phase thickness (μm)
Program 50C (2min) => 20C/min => 160C => 5C/min => 210C => 10C/min => 300C50C (2min) => 20C/min => 160C => 5C/min => 210C => 10C/min => 300C
I 2042.2061.
ReferenceOda, Ichikawa, et al., 1996Oda, Ichikawa, et al., 1996
Comment MSDC-RI MSDC-RI

Lee's RI, non-polar column, custom temperature program

Data compiled by: NIST Mass Spectrometry Data Center, William E. Wallace, director

Column type CapillaryCapillaryCapillaryCapillaryCapillary
Active phase DB-5HP-5MSHP-5MSHP-5MS5 % Phenyl methyl siloxane
Column length (m) 60.30.30.30.
Carrier gas  HeHeHe
Substrate
Column diameter (mm)  0.250.250.25
Phase thickness (μm)  0.250.250.25
Program not specified60C(2min) => 6C/min => 258C => 2C/min => 300C(4min)not specifiednot specified70 0C (2 min) 30 0C/min -> 150 0C 5 0C/min -> 200 0C 4 0C/min -> 310 0C (5 min)
I 351.352.41351.91352.41348.10
ReferenceFuentes, Font, et al., 2007Wang, Li, et al., 2007Wang, Li, et al., 2007, 2Wang, Li, et al., 2007, 2Skrbic and Onjia, 2006
Comment MSDC-RI MSDC-RI MSDC-RI MSDC-RI MSDC-RI
Column type CapillaryCapillaryCapillaryCapillaryCapillary
Active phase DB-5MSHP-5MSLM-5LM-5Ultra-1
Column length (m) 60.30.30.30.50.
Carrier gas  HeHeHeNitrogen
Substrate
Column diameter (mm) 0.250.300.250.250.32
Phase thickness (μm)  0.250.250.250.50
Program not specified50 0C (2 min) 8 0C/min -> 120 0C (3 min) 10 0C/min -> 230 0C60C(2min) => 15C/min => 180C => 5C/min => 280C (10min)60C(2min) => 15C/min => 180C => 5C/min => 280C (10min)40-100 0C 3-15 0C/min -> 290 0C
I 346.3400.00348.28348.46346.0
ReferenceAracil, Font, et al., 2005Cheng, Liu, et al., 2005Ré-Poppi and Santiago-Silva, 2005Ré-Poppi and Santiago-Silva, 2005Sremac, Skrbic, et al., 2005
Comment MSDC-RI MSDC-RI MSDC-RI MSDC-RI MSDC-RI
Column type CapillaryCapillaryCapillaryCapillaryCapillary
Active phase Ultra-1Ultra-1Ultra-1DB-5LM-5
Column length (m) 50.50.50.30.30.
Carrier gas NitrogenNitrogenNitrogen He
Substrate
Column diameter (mm) 0.320.320.320.250.25
Phase thickness (μm) 0.500.500.500.250.25
Program 40-100 0C 3-15 0C/min -> 290 0C40-100 0C 3-15 0C/min -> 290 0C40-100 0C 3-15 0C/min -> 290 0Cnot specified60C(2min) => 15C/min => 180C => 5C/min => 280C(5min)
I 348.1350.3351.2352.8348.43
ReferenceSremac, Skrbic, et al., 2005Sremac, Skrbic, et al., 2005Sremac, Skrbic, et al., 2005Lundstedt, Haglund, et al., 2003Ré-Poppi and Santiago-Silva, 2002
Comment MSDC-RI MSDC-RI MSDC-RI MSDC-RI MSDC-RI
Column type CapillaryCapillaryCapillaryCapillaryCapillary
Active phase LM-5HP-5SE-52DB-5DB-5
Column length (m) 30.25.30.30.30.
Carrier gas HeHe HeHe
Substrate
Column diameter (mm) 0.250.20.300.250.25
Phase thickness (μm) 0.250.11 0.250.25
Program 60C(2min) => 15C/min => 180C => 5C/min => 280C(5min)106C(0.2min) => 40C/min => 120C => 3C/min => 310C(10min)not specified90C (1min) => 10C/min => 120C => 4C/min => 310C (20min)90C (1min) => 10C/min => 120C => 4C/min => 310C (20min)
I 348.46350.71351.22350.52350.79
ReferenceRé-Poppi and Santiago-Silva, 2002Reckendorf, 1997Wang, Peng, et al., 1997Zamperlini, Silva, et al., 1997Zamperlini, Silva, et al., 1997
Comment MSDC-RI MSDC-RI MSDC-RI MSDC-RI MSDC-RI
Column type CapillaryCapillaryCapillaryCapillaryCapillary
Active phase SE-54SE-52CP Sil 8 CBXTI-5SE-54
Column length (m) 30.30.25.15.
Carrier gas
Substrate
Column diameter (mm) 0.250.250.320.28
Phase thickness (μm)
Program not specifiednot specified140C (2min) => (rapidly) => 200C(2min) => 5C/min => 370C140C (2min) => (rapidly) => 200C(2min) => 5C/min => 370Cnot specified
I 351.22351.51351.47351.88350.83
ReferenceChen, 1996Shaogang and Xiaobai, 1994Bemgard, Colmsjo, et al., 1992Bemgard, Colmsjo, et al., 1992Guillen, Iglesias, et al., 1992
Comment MSDC-RI MSDC-RI MSDC-RI MSDC-RI MSDC-RI
Column type CapillaryCapillaryCapillaryCapillaryCapillary
Active phase DB-5SE-54DB-5DB-5DB-5
Column length (m) 30.15. 30.30.
Carrier gas HeHeHe
Substrate
Column diameter (mm) 0.250.25 0.320.32
Phase thickness (μm) 0.250.25
Program 60 0C (3 min) 10 0C/min -> 100 0C (3 min) 5 0C/min -> 300 0C125 0C (15 min) 1 0C/min -> 131 0C 4 0C/min -> 247 0C 8 0C/min -> 280 0C (15 min)70C(2min) => 30C/min => 150C => 5C/min => 200C => 4C/min => 310Cnot specifiednot specified
I 353.2352.3348.09351.22351.22
ReferencePaschke, Herbel, et al., 1992Peterman and Delfino, 1990Takada, Onda, et al., 1990Naikwadi, Charbonneau, et al., 1987Naikwadi, Charbonneau, et al., 1987
Comment MSDC-RI MSDC-RI MSDC-RI MSDC-RI MSDC-RI
Column type CapillaryCapillaryCapillaryCapillaryCapillary
Active phase DB-5DB-5OV-101DB-5SE-52
Column length (m) 30.30. 30.
Carrier gas    He
Substrate
Column diameter (mm) 0.320.32 0.25
Phase thickness (μm)
Program not specifiednot specifiednot specifiednot specifiednot specified
I 351.98352.88351.8351.22347.32
ReferenceNaikwadi, Charbonneau, et al., 1987Naikwadi, Charbonneau, et al., 1987Tucminen, Wickstrom, et al., 1986Tong, Centen, et al., 1985Shlyakhov, 1984
Comment MSDC-RI MSDC-RI MSDC-RI MSDC-RI MSDC-RI
Column type CapillaryCapillaryCapillaryCapillaryCapillary
Active phase SE-52SE-52SE-52SE-52SE-52
Column length (m)
Carrier gas
Substrate
Column diameter (mm)
Phase thickness (μm)
Program not specifiednot specifiednot specifiednot specifiednot specified
I 347.87348.49349.15350.66351.22
ReferenceShlyakhov, 1984Shlyakhov, 1984Shlyakhov, 1984Shlyakhov, 1984Shlyakhov, 1984
Comment MSDC-RI MSDC-RI MSDC-RI MSDC-RI MSDC-RI
Column type CapillaryCapillary
Active phase SE-52SE-52
Column length (m)
Carrier gas
Substrate
Column diameter (mm)
Phase thickness (μm)
Program not specifiednot specified
I 352.30353.34
ReferenceShlyakhov, 1984Shlyakhov, 1984
Comment MSDC-RI MSDC-RI

References

Roux, Temprado, et al., 2008
Roux, M.V.; Temprado, M.; Chickos, J.S.; Nagano, Y.,
Critically Evaluated Thermochemical Properties of Polycyclic Aromatic Hydrocarbons,
J. Phys. Chem. Ref. Data, 2008, 37, 4, 1855-1996. [all data]
Smith, Stewart, et al., 1980
Smith, N.K.; Stewart, R.C., Jr.; Osborn, A.G.; Scott, D.W.,
Pyrene: vapor pressure, enthalpy of combustion, and chemical thermodynamic properties,
J. Chem. Thermodyn., 1980, 12, 919-926. [all data]
Westrum and Wong, 1967
Westrum, E.F., Jr.; Wong, S.,
Strain energies and thermal properties of globular and polynuclear aromatic molecules,
AEC Rept. Coo-1149-92, Contract AT(11-1)-1149, 1967, 1-7. [all data]
Richardson and Parks, 1939
Richardson, J.W.; Parks, G.S.,
Thermal data on organic compounds. XIX. Modern combustion data for some non-volatile compounds containing carbon, hydrogen and oxygen,
J. Am. Chem. Soc., 1939, 61, 3543-3546. [all data]
Dorofeeva O.V., 1988
Dorofeeva O.V.,
Thermodynamic Properties of Polycyclic Aromatic Hydrocarbons in the Gaseous Phase. Institute for High Temperatures, USSR Academy of Sciences, Preprint No.1-238 (in Russian), Moscow, 1988. [all data]
Frenkel M., 1994
Frenkel M.,
Thermodynamics of Organic Compounds in the Gas State, Vol. I, II, Thermodynamics Research Center, College Station, Texas, 1994, 1994. [all data]
Smith N.K., 1980
Smith N.K., Jr.,
Pyrene: vapor pressure, enthalpy of combustion, and chemical thermodynamic properties,
J. Chem. Thermodyn., 1980, 12, 919-926. [all data]
Cox and Pilcher, 1970
Cox, J.D.; Pilcher, G.,
Thermochemistry of Organic and Organometallic Compounds, Academic Press, New York, 1970, 1-636. [all data]
Richardson, 1939
Richardson, J.W.,
Precise determination of the heats of combustion of some representative organic compounds, Ph.D. Thesis for Standford University, 1939, 1-122. [all data]
Wong and Westrum, 1971
Wong, W-K.; Westrum, E.F., Jr.,
Thermodynamics of polynuclear aromatic molecules. I. Heat capacities and enthalpies of fusion of pyrene, flouranthene, and triphenylene,
J. Chem. Thermodynam., 1971, 3, 105-124. [all data]
Jacobs and Parks, 1934
Jacobs, C.J.; Parks, G.S.,
Thermal data on organic compounds. XIV. Some heat capacity, entropy and free energy data for cyclic substances,
J. Am. Chem. Soc., 1934, 56, 1513-1517. [all data]
Wong and Westrum, 1971, 2
Wong, W.-K.; Westrum, E.F.,
Thermodynamics of Polynuclear Aromatic Molecules. 1. Heat Capacities and Enthalpies of Fusion of Pyrene, Fluoranthene, and Triphenylene,
J. Chem. Thermodyn., 1971, 3, 105-24. [all data]
Hanshaw, Nutt, et al., 2008
Hanshaw, William; Nutt, Marjorie; Chickos, James S.,
Hypothetical Thermodynamic Properties. Subcooled Vaporization Enthalpies and Vapor Pressures of Polyaromatic Hydrocarbons,
J. Chem. Eng. Data, 2008, 53, 8, 1903-1913, https://doi.org/10.1021/je800300x
. [all data]
Teodorescu, Barhala, et al., 2006
Teodorescu, Mariana; Barhala, Alexandru; Dragoescu, Dana,
Isothermal (vapour+liquid) equilibria for the binary (cyclopentanone or cyclohexanone with 1,1,2,2-tetrachloroethane) systems at temperatures of (343.15, 353.15, and 363.15)K,
The Journal of Chemical Thermodynamics, 2006, 38, 11, 1432-1437, https://doi.org/10.1016/j.jct.2006.01.010
. [all data]
Siddiqi, Siddiqui, et al., 2009
Siddiqi, M. Aslam; Siddiqui, Rehan A.; Atakan, Burak,
Thermal Stability, Sublimation Pressures, and Diffusion Coefficients of Anthracene, Pyrene, and Some Metal β-Diketonates,
J. Chem. Eng. Data, 2009, 54, 10, 2795-2802, https://doi.org/10.1021/je9001653
. [all data]
Rojas and Orozco, 2003
Rojas, Aarón; Orozco, Eulogio,
Measurement of the enthalpies of vaporization and sublimation of solids aromatic hydrocarbons by differential scanning calorimetry,
Thermochimica Acta, 2003, 405, 1, 93-107, https://doi.org/10.1016/S0040-6031(03)00139-4
. [all data]
Hinckley, Bidleman, et al., 1990
Hinckley, Daniel A.; Bidleman, Terry F.; Foreman, William T.; Tuschall, Jack R.,
Determination of vapor pressures for nonpolar and semipolar organic compounds from gas chromatograhic retention data,
J. Chem. Eng. Data, 1990, 35, 3, 232-237, https://doi.org/10.1021/je00061a003
. [all data]
Sasse, Jose, et al., 1988
Sasse, Karim; Jose, Jacques; Merlin, Jean-Claude,
A static apparatus for measurement of low vapor pressures. Experimental results on high molecular-weight hydrocarbons,
Fluid Phase Equilibria, 1988, 42, 287-304, https://doi.org/10.1016/0378-3812(88)80065-7
. [all data]
Stephenson and Malanowski, 1987
Stephenson, Richard M.; Malanowski, Stanislaw,
Handbook of the Thermodynamics of Organic Compounds, 1987, https://doi.org/10.1007/978-94-009-3173-2
. [all data]
Tsypikina and Ya, 1955
Tsypikina, O.; Ya, J.,
J. Appl. Chem. USSR, 1955, 28, 167. [all data]
Tsypkina, 1955
Tsypkina, O.Y.,
Study of Vacuum Pressure Influence on Efficiency of Separation of Some Polynuclear Compounds of Coal Tar Rectifications,
Zh. Prikl. Khim. (Moscow), 1955, 28, 2, 185-192. [all data]
Oja and Suuberg, 1998
Oja, Vahur; Suuberg, Eric M.,
Vapor Pressures and Enthalpies of Sublimation of Polycyclic Aromatic Hydrocarbons and Their Derivatives,
J. Chem. Eng. Data, 1998, 43, 3, 486-492, https://doi.org/10.1021/je970222l
. [all data]
Nass, Lenoir, et al., 1995
Nass, Karen; Lenoir, Dieter; Kettrup, Antonius,
Calculation of the Thermodynamic Properties of Polycyclic Aromatic Hydrocarbons by an Incremental Procedure,
Angew. Chem. Int. Ed. Engl., 1995, 34, 16, 1735-1736, https://doi.org/10.1002/anie.199517351
. [all data]
Sonnefeld, Zoller, et al., 1983
Sonnefeld, W.J.; Zoller, W.H.; May, W.E.,
Dynamic coupled-column liquid-chromatographic determination of ambient-temperature vapor pressures of polynuclear aromatic hydrocarbons,
Anal. Chem., 1983, 55, 2, 275-280, https://doi.org/10.1021/ac00253a022
. [all data]
Malaspina, Bardi, et al., 1974
Malaspina, L.; Bardi, G.; Gigli, R.,
Simultaneous determination by knudsen-effusion microcalorimetric technique of the vapor pressure and enthalpy of vaporization of pyrene and 1,3,5-triphenylbenzene,
The Journal of Chemical Thermodynamics, 1974, 6, 11, 1053-1064, https://doi.org/10.1016/0021-9614(74)90067-6
. [all data]
Hoyer and Peperle, 1958
Hoyer, H.; Peperle, W.,
Z. Elektrochem., 1958, 62, 61. [all data]
Bradley and Cleasby, 1953
Bradley, R.S.; Cleasby, T.G.,
The vapour pressure and lattice energy of some aromatic ring compounds,
J. Am. Chem. Soc., 1953, 1690-16. [all data]
Inokuchi, Shiba, et al., 1952
Inokuchi, Hiroo; Shiba, Sukekuni; Handa, Takashi; Akamatu, Hideo,
Heats of Sublimation of Condensed Polynuclear Aromatic Hydrocarbons,
Bull. Chem. Soc. Jpn., 1952, 25, 5, 299-302, https://doi.org/10.1246/bcsj.25.299
. [all data]
Domalski and Hearing, 1996
Domalski, Eugene S.; Hearing, Elizabeth D.,
Heat Capacities and Entropies of Organic Compounds in the Condensed Phase. Volume III,
J. Phys. Chem. Ref. Data, 1996, 25, 1, 1, https://doi.org/10.1063/1.555985
. [all data]
Meot-Ner (Mautner), 1980
Meot-Ner (Mautner), M.,
Dimer Cations of Polycyclic Aromatics: Experimental Bonding Energies and Resonance Stabilization,
J. Phys. Chem., 1980, 84, 21, 2724, https://doi.org/10.1021/j100458a012
. [all data]
Hunter and Lias, 1998
Hunter, E.P.; Lias, S.G.,
Evaluated Gas Phase Basicities and Proton Affinities of Molecules: An Update,
J. Phys. Chem. Ref. Data, 1998, 27, 3, 413-656, https://doi.org/10.1063/1.556018
. [all data]
Ando, Kokubo, et al., 2004
Ando, N.; Kokubo, S.; Mitsui, M.; Nakajima, A.,
Photoelectron spectroscopy of pyrene cluster anions, (pyrene)(-)(n) (n=1-20),
Chem. Phys. Lett., 2004, 389, 4-6, 279-283, https://doi.org/10.1016/j.cplett.2004.03.100
. [all data]
Wentworth and Becker, 1962
Wentworth, W.E.; Becker, R.S.,
Potential Method for the Determination of Electron Affinities of Molecules: Application to Some Aromatic Hydrocarbons.,
J. Am. Chem. Soc., 1962, 84, 22, 4263, https://doi.org/10.1021/ja00881a014
. [all data]
Lyons, Morris, et al., 1968
Lyons, L.E.; Morris, G.C.; Warren, L.J.,
Electron Affinities and the Electron Capture Method for Aromatic Hydrocarbons,
J. Phys. Chem., 1968, 72, 10, 3677, https://doi.org/10.1021/j100856a056
. [all data]
Becker and Chen, 1966
Becker, R.S.; Chen, E.,
Extension of Electron Affinities and Ionization Potentials of Aromatic Hydrocarbons,
J. Chem. Phys., 1966, 45, 7, 2403, https://doi.org/10.1063/1.1727954
. [all data]
Aue, Guidoni, et al., 2000
Aue, D.H.; Guidoni, M.; Betowski, L.D.,
Ab initio calculated gas-phase basicities of polynuclear aromatic hydrocarbons,
Int. J. Mass Spectrom., 2000, 201, 283. [all data]
Hager and Wallace, 1988
Hager, J.W.; Wallace, S.C.,
Two-laser photoionization supersonic jet mass spectrometry of aromatic molecules,
Anal. Chem., 1988, 60, 5. [all data]
Clar, Robertson, et al., 1981
Clar, E.; Robertson, J.M.; Schlogl, R.; Schmidt, W.,
Photoelectron spectra of polynuclear aromatics. 6. Application to structural elucidation: 'Circumanthracene',
J. Am. Chem. Soc., 1981, 103, 1320. [all data]
Mautner(Meot-Ner), 1980
Mautner(Meot-Ner), M.,
Ion thermochemistry of low volatility compounds in the gas phase. 3. Polycyclic aromatics: Ionization energies, proton, and hydrogen affinities. Extrapolations to graphite,
J. Phys. Chem., 1980, 84, 2716. [all data]
Clar and Schmidt, 1979
Clar, E.; Schmidt, W.,
Correlations between photoelectron and UV absorption spectra of polycyclic hydrocarbons. The pyrene series,
Tetrahedron, 1979, 35, 1027. [all data]
Dewar and Goodman, 1972
Dewar, M.J.S.; Goodman, D.W.,
Photoelectron spectra of molecules. Part 5.--Polycyclic aromatic hydrocarbons,
J. Chem. Soc. Faraday Trans. 2, 1972, 68, 1784. [all data]
Wacks, 1964
Wacks, M.E.,
Electron-impact studies of aromatic hydrocarbons. II. Naphthacene, naphthaphene, chrysene, triphenylene, and pyrene,
J. Chem. Phys., 1964, 41, 1661. [all data]
Kuroda, 1964
Kuroda, H.,
Ionization potentials of polycyclic aromatic hydrocarbons,
Nature, 1964, 201, 1214. [all data]
Finch, 1964
Finch, A.C.M.,
Charge-transfer spectra and the ionization energy of azulene,
J. Chem. Soc., 1964, 2272. [all data]
Briegleb, 1964
Briegleb, G.,
Electron affinity of organic molecules,
Angew. Chem. Intern. Ed., 1964, 3, 617. [all data]
Kinoshita, 1962
Kinoshita, M.,
The absorption spectra of the molecular complexes of aromatic compounds with p-bromanil,
Bull. Chem. Soc. Japan, 1962, 35, 1609. [all data]
Briegleb, Czekalla, et al., 1961
Briegleb, G.; Czekalla, J.; Reuss, G.,
Mesomeriemomente und Elektronenuberfuhrungsbanden von Elektronen-donator-akzeptor-komplexen des Chloranils und Tetracyanathylens mit aromatischen Kohlenwasserstoffen,
Z. Phys. Chem. (Neue Folge), 1961, 30, 333. [all data]
Birks and Stifkin, 1961
Birks, J.B.; Stifkin, M.A.,
π-Electronic excitation and ionization energies of condensed ring aromatic hydrocarbons,
Nature, 1961, 191, 761. [all data]
Briegleb and Czekalla, 1959
Briegleb, G.; Czekalla, J.,
Die Bestimmung von lonisierungsenergien aus den Spektren von Elektronenubergangskomplexen,
Z.Elektrochem., 1959, 63, 6. [all data]
Matsen, 1956
Matsen, F.A.,
Electron affinities, methyl affinities, and ionization energies of condensed ring aromatic hydrocarbons,
J. Chem. Phys., 1956, 24, 602. [all data]
Akiyama, Li, et al., 1979
Akiyama, I.; Li, K.C.; LeBreton, P.R.; Fu, P.P.; Harvey, R.G.,
Ultraviolet photoelectron studies of polycyclic aromatic hydrocarbons. The ground-state electronic structure of aryloxiranes and metabolites of benzo[a]pyrene,
J. Phys. Chem., 1979, 83, 2997. [all data]
Clar and Schmidt, 1976
Clar, E.; Schmidt, W.,
Correlations between photoelectron and phosphorescence spectra of polycyclic hydrocarbons,
Tetrahedron, 1976, 32, 2563. [all data]
Boschi and Schmidt, 1972
Boschi, R.; Schmidt, W.,
Photoelectron spectra of polycyclic aromatic hydrocarbons. Pyrene and coronene,
Tetrahedron Lett., 1972, 25, 2577. [all data]