Uranium,chlorotris(η5-2,4-cyclopentadien-1-yl)-
- Formula: C15H15ClU
- Molecular weight: 468.762
- CAS Registry Number: 1284-81-7

Condensed phase thermochemistry data

Data compiled by: José A. Martinho Simões
Quantity | Value | Units | Method | Reference | Comment |
---|---|---|---|---|---|
ΔfH°solid | 52. ± 25. | kJ/mol | Review | Martinho Simões | |
Quantity | Value | Units | Method | Reference | Comment |
ΔcH°solid | -9314. ± 25. | kJ/mol | CC-SB | Tel'noi, Rabinovich, et al., 1989 |

Phase change data

Data compiled by: José A. Martinho Simões
Quantity | Value | Units | Method | Reference | Comment |
---|---|---|---|---|---|
ΔsubH° | 120. ± 8. | kJ/mol | CC-SB | Tel'noi, Rabinovich, et al., 1989 |

Gas phase ion energetics data

Data compiled by: Sharon G. Lias, Rhoda D. Levin, and Sherif A. Kafafi
Ionization energy determinations
IE (eV) | Method | Reference | Comment |
---|---|---|---|
6.90 | PE | Fragala, Ciliberto, et al., 1976 | Vertical value |

Gas phase thermochemistry data

Data compiled by: José A. Martinho Simões
Quantity | Value | Units | Method | Reference | Comment |
---|---|---|---|---|---|
ΔfH°gas | 172. ± 26. | kJ/mol | Review | Martinho Simões |

References

Martinho Simões
Martinho Simões, J.A.,
Private communication (see http://webbook.nist.gov/chemistry/om/). [all data]
Tel'noi, Rabinovich, et al., 1989
Tel'noi, V.I.; Rabinovich, I.B.; Larina, V.N.; Leonov, M.R.; Solov'eva, G.V.,
Radiokhimiya, 1989, 31, 38. [all data]
Fragala, Ciliberto, et al., 1976
Fragala, I.; Ciliberto, E.; Fischer, R.D.; Sienel, G.R.; Zanella, P.,
Photoelectron spectroscopy of f-element organometallic compounds II. Tricyclopentadienyl derivatives of uranium(IV) thorium (IV).,
J. Organomet. Chem., 1976, 120, 9. [all data]